hadoop-mapreduce-dev mailing list archives

Site index · List index
Message view « Date » · « Thread »
Top « Date » · « Thread »
From Apache Jenkins Server <jenk...@builds.apache.org>
Subject Hadoop-Mapreduce-trunk - Build # 2172 - Still Failing
Date Fri, 12 Jun 2015 13:39:32 GMT
See https://builds.apache.org/job/Hadoop-Mapreduce-trunk/2172/

###################################################################################
########################## LAST 60 LINES OF THE CONSOLE ###########################
[...truncated 31573 lines...]
Tests run: 5, Failures: 0, Errors: 0, Skipped: 0, Time elapsed: 0.69 sec - in org.apache.hadoop.mapreduce.jobhistory.TestEvents

Results :

Tests in error: 
  TestJobHistoryEventHandler.testTimelineEventHandling:501 ยป YarnRuntime java.io...

Tests run: 313, Failures: 0, Errors: 1, Skipped: 0

[INFO] ------------------------------------------------------------------------
[INFO] Reactor Summary:
[INFO] 
[INFO] Apache Hadoop MapReduce Client .................... SUCCESS [  2.945 s]
[INFO] Apache Hadoop MapReduce Core ...................... SUCCESS [01:27 min]
[INFO] Apache Hadoop MapReduce Common .................... SUCCESS [ 29.010 s]
[INFO] Apache Hadoop MapReduce Shuffle ................... SUCCESS [  4.937 s]
[INFO] Apache Hadoop MapReduce App ....................... FAILURE [09:19 min]
[INFO] Apache Hadoop MapReduce HistoryServer ............. SKIPPED
[INFO] Apache Hadoop MapReduce JobClient ................. SKIPPED
[INFO] Apache Hadoop MapReduce HistoryServer Plugins ..... SKIPPED
[INFO] Apache Hadoop MapReduce NativeTask ................ SKIPPED
[INFO] Apache Hadoop MapReduce Examples .................. SKIPPED
[INFO] Apache Hadoop MapReduce ........................... SKIPPED
[INFO] ------------------------------------------------------------------------
[INFO] BUILD FAILURE
[INFO] ------------------------------------------------------------------------
[INFO] Total time: 11:24 min
[INFO] Finished at: 2015-06-12T13:39:19+00:00
[INFO] Final Memory: 40M/835M
[INFO] ------------------------------------------------------------------------
[ERROR] Failed to execute goal org.apache.maven.plugins:maven-surefire-plugin:2.17:test (default-test)
on project hadoop-mapreduce-client-app: There are test failures.
[ERROR] 
[ERROR] Please refer to /home/jenkins/jenkins-slave/workspace/Hadoop-Mapreduce-trunk/hadoop-mapreduce-project/hadoop-mapreduce-client/hadoop-mapreduce-client-app/target/surefire-reports
for the individual test results.
[ERROR] -> [Help 1]
[ERROR] 
[ERROR] To see the full stack trace of the errors, re-run Maven with the -e switch.
[ERROR] Re-run Maven using the -X switch to enable full debug logging.
[ERROR] 
[ERROR] For more information about the errors and possible solutions, please read the following
articles:
[ERROR] [Help 1] http://cwiki.apache.org/confluence/display/MAVEN/MojoFailureException
[ERROR] 
[ERROR] After correcting the problems, you can resume the build with the command
[ERROR]   mvn <goals> -rf :hadoop-mapreduce-client-app
Build step 'Execute shell' marked build as failure
[FINDBUGS] Skipping publisher since build result is FAILURE
Archiving artifacts
Sending artifact delta relative to Hadoop-Mapreduce-trunk #2161
Archived 1 artifacts
Archive block size is 32768
Received 0 blocks and 20388632 bytes
Compression is 0.0%
Took 6.2 sec
Recording test results
Updating YARN-3794
Updating HDFS-8566
Updating HDFS-8573
Updating HDFS-8583
Email was triggered for: Failure
Sending email for trigger: Failure



###################################################################################
############################## FAILED TESTS (if any) ##############################
1 tests failed.
REGRESSION:  org.apache.hadoop.mapreduce.jobhistory.TestJobHistoryEventHandler.testTimelineEventHandling

Error Message:
java.io.IOException: ApplicationHistoryServer failed to start. Final state is STOPPED

Stack Trace:
org.apache.hadoop.yarn.exceptions.YarnRuntimeException: java.io.IOException: ApplicationHistoryServer
failed to start. Final state is STOPPED
	at org.apache.hadoop.yarn.server.MiniYARNCluster$ApplicationHistoryServerWrapper.serviceStart(MiniYARNCluster.java:725)
	at org.apache.hadoop.service.AbstractService.start(AbstractService.java:193)
	at org.apache.hadoop.service.CompositeService.serviceStart(CompositeService.java:120)
	at org.apache.hadoop.service.AbstractService.start(AbstractService.java:193)
	at org.apache.hadoop.mapreduce.jobhistory.TestJobHistoryEventHandler.testTimelineEventHandling(TestJobHistoryEventHandler.java:501)



Mime
  • Unnamed multipart/mixed (inline, None, 0 bytes)
View raw message