hadoop-mapreduce-dev mailing list archives

Site index · List index
Message view « Date » · « Thread »
Top « Date » · « Thread »
From Apache Jenkins Server <jenk...@builds.apache.org>
Subject Hadoop-Mapreduce-trunk-Java8 - Build # 237 - Still Failing
Date Thu, 25 Jun 2015 16:11:11 GMT
See https://builds.apache.org/job/Hadoop-Mapreduce-trunk-Java8/237/

###################################################################################
########################## LAST 60 LINES OF THE CONSOLE ###########################
[...truncated 10887 lines...]

Tests run: 522, Failures: 1, Errors: 0, Skipped: 11

[INFO] ------------------------------------------------------------------------
[INFO] Reactor Summary:
[INFO] 
[INFO] Apache Hadoop MapReduce Client .................... SUCCESS [  2.250 s]
[INFO] Apache Hadoop MapReduce Core ...................... SUCCESS [01:17 min]
[INFO] Apache Hadoop MapReduce Common .................... SUCCESS [ 25.644 s]
[INFO] Apache Hadoop MapReduce Shuffle ................... SUCCESS [  4.117 s]
[INFO] Apache Hadoop MapReduce App ....................... SUCCESS [10:04 min]
[INFO] Apache Hadoop MapReduce HistoryServer ............. SUCCESS [06:05 min]
[INFO] Apache Hadoop MapReduce JobClient ................. FAILURE [  01:44 h]
[INFO] Apache Hadoop MapReduce HistoryServer Plugins ..... SKIPPED
[INFO] Apache Hadoop MapReduce NativeTask ................ SKIPPED
[INFO] Apache Hadoop MapReduce Examples .................. SKIPPED
[INFO] Apache Hadoop MapReduce ........................... SKIPPED
[INFO] ------------------------------------------------------------------------
[INFO] BUILD FAILURE
[INFO] ------------------------------------------------------------------------
[INFO] Total time: 02:02 h
[INFO] Finished at: 2015-06-25T16:10:54+00:00
[INFO] Final Memory: 34M/205M
[INFO] ------------------------------------------------------------------------
[ERROR] Failed to execute goal org.apache.maven.plugins:maven-surefire-plugin:2.17:test (default-test)
on project hadoop-mapreduce-client-jobclient: There are test failures.
[ERROR] 
[ERROR] Please refer to /home/jenkins/jenkins-slave/workspace/Hadoop-Mapreduce-trunk-Java8/hadoop-mapreduce-project/hadoop-mapreduce-client/hadoop-mapreduce-client-jobclient/target/surefire-reports
for the individual test results.
[ERROR] -> [Help 1]
[ERROR] 
[ERROR] To see the full stack trace of the errors, re-run Maven with the -e switch.
[ERROR] Re-run Maven using the -X switch to enable full debug logging.
[ERROR] 
[ERROR] For more information about the errors and possible solutions, please read the following
articles:
[ERROR] [Help 1] http://cwiki.apache.org/confluence/display/MAVEN/MojoFailureException
[ERROR] 
[ERROR] After correcting the problems, you can resume the build with the command
[ERROR]   mvn <goals> -rf :hadoop-mapreduce-client-jobclient
Build step 'Execute shell' marked build as failure
[FINDBUGS] Skipping publisher since build result is FAILURE
Archiving artifacts
Sending artifact delta relative to Hadoop-Mapreduce-trunk-Java8 #213
Archived 1 artifacts
Archive block size is 32768
Received 0 blocks and 20409475 bytes
Compression is 0.0%
Took 8.3 sec
Recording test results
Updating MAPREDUCE-6400
Updating HDFS-8646
Updating YARN-3826
Updating HADOOP-12049
Updating YARN-3809
Updating HADOOP-11958
Updating YARN-3790
Updating YARN-3832
Updating YARN-3745
Updating YARN-3360
Email was triggered for: Failure
Sending email for trigger: Failure



###################################################################################
############################## FAILED TESTS (if any) ##############################
1 tests failed.
FAILED:  org.apache.hadoop.mapred.TestLocalJobSubmission.testLocalJobLibjarsOption

Error Message:
Job failed

Stack Trace:
java.lang.AssertionError: Job failed
	at org.junit.Assert.fail(Assert.java:88)
	at org.apache.hadoop.mapred.TestLocalJobSubmission.testLocalJobLibjarsOption(TestLocalJobSubmission.java:77)



Mime
  • Unnamed multipart/mixed (inline, None, 0 bytes)
View raw message