hadoop-mapreduce-dev mailing list archives

Site index · List index
Message view « Date » · « Thread »
Top « Date » · « Thread »
From Apache Jenkins Server <jenk...@builds.apache.org>
Subject Hadoop-Mapreduce-trunk - Build # 2164 - Still Failing
Date Thu, 04 Jun 2015 15:58:02 GMT
See https://builds.apache.org/job/Hadoop-Mapreduce-trunk/2164/

###################################################################################
########################## LAST 60 LINES OF THE CONSOLE ###########################
[...truncated 32120 lines...]

[INFO] ------------------------------------------------------------------------
[INFO] Reactor Summary:
[INFO] 
[INFO] Apache Hadoop MapReduce Client .................... SUCCESS [  2.762 s]
[INFO] Apache Hadoop MapReduce Core ...................... SUCCESS [01:24 min]
[INFO] Apache Hadoop MapReduce Common .................... SUCCESS [ 28.388 s]
[INFO] Apache Hadoop MapReduce Shuffle ................... SUCCESS [  4.739 s]
[INFO] Apache Hadoop MapReduce App ....................... SUCCESS [09:19 min]
[INFO] Apache Hadoop MapReduce HistoryServer ............. SUCCESS [05:31 min]
[INFO] Apache Hadoop MapReduce JobClient ................. FAILURE [  01:48 h]
[INFO] Apache Hadoop MapReduce HistoryServer Plugins ..... SKIPPED
[INFO] Apache Hadoop MapReduce NativeTask ................ SKIPPED
[INFO] Apache Hadoop MapReduce Examples .................. SKIPPED
[INFO] Apache Hadoop MapReduce ........................... SKIPPED
[INFO] ------------------------------------------------------------------------
[INFO] BUILD FAILURE
[INFO] ------------------------------------------------------------------------
[INFO] Total time: 02:05 h
[INFO] Finished at: 2015-06-04T15:57:33+00:00
[INFO] Final Memory: 35M/719M
[INFO] ------------------------------------------------------------------------
[ERROR] Failed to execute goal org.apache.maven.plugins:maven-surefire-plugin:2.17:test (default-test)
on project hadoop-mapreduce-client-jobclient: There are test failures.
[ERROR] 
[ERROR] Please refer to /home/jenkins/jenkins-slave/workspace/Hadoop-Mapreduce-trunk/hadoop-mapreduce-project/hadoop-mapreduce-client/hadoop-mapreduce-client-jobclient/target/surefire-reports
for the individual test results.
[ERROR] -> [Help 1]
[ERROR] 
[ERROR] To see the full stack trace of the errors, re-run Maven with the -e switch.
[ERROR] Re-run Maven using the -X switch to enable full debug logging.
[ERROR] 
[ERROR] For more information about the errors and possible solutions, please read the following
articles:
[ERROR] [Help 1] http://cwiki.apache.org/confluence/display/MAVEN/MojoFailureException
[ERROR] 
[ERROR] After correcting the problems, you can resume the build with the command
[ERROR]   mvn <goals> -rf :hadoop-mapreduce-client-jobclient
Build step 'Execute shell' marked build as failure
[FINDBUGS] Skipping publisher since build result is FAILURE
Archiving artifacts
Sending artifact delta relative to Hadoop-Mapreduce-trunk #2161
Archived 1 artifacts
Archive block size is 32768
Received 0 blocks and 20384213 bytes
Compression is 0.0%
Took 7 sec
Recording test results
Updating YARN-3762
Updating MAPREDUCE-6382
Updating MAPREDUCE-5965
Updating MAPREDUCE-6174
Updating MAPREDUCE-6374
Updating YARN-3749
Updating YARN-41
Updating YARN-1462
Updating HADOOP-12018
Updating YARN-3751
Updating HADOOP-12019
Updating YARN-3585
Email was triggered for: Failure
Sending email for trigger: Failure



###################################################################################
############################## FAILED TESTS (if any) ##############################
4 tests failed.
REGRESSION:  org.apache.hadoop.mapred.TestMerge.testMerge

Error Message:
expected:<10000> but was:<2500>

Stack Trace:
junit.framework.AssertionFailedError: expected:<10000> but was:<2500>
	at junit.framework.Assert.fail(Assert.java:57)
	at junit.framework.Assert.failNotEquals(Assert.java:329)
	at junit.framework.Assert.assertEquals(Assert.java:78)
	at junit.framework.Assert.assertEquals(Assert.java:159)
	at junit.framework.Assert.assertEquals(Assert.java:166)
	at junit.framework.TestCase.assertEquals(TestCase.java:324)
	at org.apache.hadoop.mapred.TestMerge.verifyOutput(TestMerge.java:186)
	at org.apache.hadoop.mapred.TestMerge.runMergeTest(TestMerge.java:146)
	at org.apache.hadoop.mapred.TestMerge.testMerge(TestMerge.java:87)


REGRESSION:  org.apache.hadoop.mapred.TestMiniMRClientCluster.testJob

Error Message:
null

Stack Trace:
java.lang.AssertionError: null
	at org.junit.Assert.fail(Assert.java:86)
	at org.junit.Assert.assertTrue(Assert.java:41)
	at org.junit.Assert.assertTrue(Assert.java:52)
	at org.apache.hadoop.mapred.TestMiniMRClientCluster.testJob(TestMiniMRClientCluster.java:162)


REGRESSION:  org.apache.hadoop.mapred.TestReduceFetchFromPartialMem.testReduceFromPartialMem

Error Message:
Job failed!

Stack Trace:
java.io.IOException: Job failed!
	at org.apache.hadoop.mapred.JobClient.runJob(JobClient.java:867)
	at org.apache.hadoop.mapred.TestReduceFetchFromPartialMem.runJob(TestReduceFetchFromPartialMem.java:300)
	at org.apache.hadoop.mapred.TestReduceFetchFromPartialMem.testReduceFromPartialMem(TestReduceFetchFromPartialMem.java:93)


REGRESSION:  org.apache.hadoop.mapred.TestReduceFetchFromPartialMem.testReduceFromPartialMem

Error Message:
Job failed!

Stack Trace:
java.io.IOException: Job failed!
	at org.apache.hadoop.mapred.JobClient.runJob(JobClient.java:867)
	at org.apache.hadoop.mapred.TestReduceFetchFromPartialMem.runJob(TestReduceFetchFromPartialMem.java:300)
	at org.apache.hadoop.mapred.TestReduceFetchFromPartialMem.testReduceFromPartialMem(TestReduceFetchFromPartialMem.java:93)



Mime
  • Unnamed multipart/mixed (inline, None, 0 bytes)
View raw message