hadoop-mapreduce-dev mailing list archives

Site index · List index
Message view « Date » · « Thread »
Top « Date » · « Thread »
From Apache Jenkins Server <jenk...@builds.apache.org>
Subject Hadoop-Mapreduce-trunk - Build # 2167 - Still Failing
Date Sun, 07 Jun 2015 15:32:30 GMT
See https://builds.apache.org/job/Hadoop-Mapreduce-trunk/2167/

###################################################################################
########################## LAST 60 LINES OF THE CONSOLE ###########################
[...truncated 32106 lines...]

Failed tests: 
  TestMRIntermediateDataEncryption.testMultipleMapsPerNode:65->doEncryptionTest:75->doEncryptionTest:95->runMergeTest:161->verifyOutput:200
expected:<8000> but was:<0>

Tests in error: 
  TestReduceFetchFromPartialMem.testReduceFromPartialMem:93->runJob:300 » IO Job...
  TestReduceFetchFromPartialMem.testReduceFromPartialMem:93->runJob:300 » IO Job...

Tests run: 522, Failures: 1, Errors: 2, Skipped: 11

[INFO] ------------------------------------------------------------------------
[INFO] Reactor Summary:
[INFO] 
[INFO] Apache Hadoop MapReduce Client .................... SUCCESS [  2.737 s]
[INFO] Apache Hadoop MapReduce Core ...................... SUCCESS [01:22 min]
[INFO] Apache Hadoop MapReduce Common .................... SUCCESS [ 27.927 s]
[INFO] Apache Hadoop MapReduce Shuffle ................... SUCCESS [  4.691 s]
[INFO] Apache Hadoop MapReduce App ....................... SUCCESS [09:10 min]
[INFO] Apache Hadoop MapReduce HistoryServer ............. SUCCESS [05:32 min]
[INFO] Apache Hadoop MapReduce JobClient ................. FAILURE [  01:48 h]
[INFO] Apache Hadoop MapReduce HistoryServer Plugins ..... SKIPPED
[INFO] Apache Hadoop MapReduce NativeTask ................ SKIPPED
[INFO] Apache Hadoop MapReduce Examples .................. SKIPPED
[INFO] Apache Hadoop MapReduce ........................... SKIPPED
[INFO] ------------------------------------------------------------------------
[INFO] BUILD FAILURE
[INFO] ------------------------------------------------------------------------
[INFO] Total time: 02:05 h
[INFO] Finished at: 2015-06-07T15:32:15+00:00
[INFO] Final Memory: 34M/741M
[INFO] ------------------------------------------------------------------------
[ERROR] Failed to execute goal org.apache.maven.plugins:maven-surefire-plugin:2.17:test (default-test)
on project hadoop-mapreduce-client-jobclient: There are test failures.
[ERROR] 
[ERROR] Please refer to /home/jenkins/jenkins-slave/workspace/Hadoop-Mapreduce-trunk/hadoop-mapreduce-project/hadoop-mapreduce-client/hadoop-mapreduce-client-jobclient/target/surefire-reports
for the individual test results.
[ERROR] -> [Help 1]
[ERROR] 
[ERROR] To see the full stack trace of the errors, re-run Maven with the -e switch.
[ERROR] Re-run Maven using the -X switch to enable full debug logging.
[ERROR] 
[ERROR] For more information about the errors and possible solutions, please read the following
articles:
[ERROR] [Help 1] http://cwiki.apache.org/confluence/display/MAVEN/MojoFailureException
[ERROR] 
[ERROR] After correcting the problems, you can resume the build with the command
[ERROR]   mvn <goals> -rf :hadoop-mapreduce-client-jobclient
Build step 'Execute shell' marked build as failure
[FINDBUGS] Skipping publisher since build result is FAILURE
Archiving artifacts
Sending artifact delta relative to Hadoop-Mapreduce-trunk #2161
Archived 1 artifacts
Archive block size is 32768
Received 0 blocks and 20385621 bytes
Compression is 0.0%
Took 6.2 sec
Recording test results
Updating HDFS-8116
Updating HADOOP-12055
Updating HDFS-8432
Email was triggered for: Failure
Sending email for trigger: Failure



###################################################################################
############################## FAILED TESTS (if any) ##############################
3 tests failed.
REGRESSION:  org.apache.hadoop.mapred.TestMRIntermediateDataEncryption.testMultipleMapsPerNode

Error Message:
expected:<8000> but was:<0>

Stack Trace:
java.lang.AssertionError: expected:<8000> but was:<0>
	at org.junit.Assert.fail(Assert.java:88)
	at org.junit.Assert.failNotEquals(Assert.java:743)
	at org.junit.Assert.assertEquals(Assert.java:118)
	at org.junit.Assert.assertEquals(Assert.java:555)
	at org.junit.Assert.assertEquals(Assert.java:542)
	at org.apache.hadoop.mapred.TestMRIntermediateDataEncryption.verifyOutput(TestMRIntermediateDataEncryption.java:200)
	at org.apache.hadoop.mapred.TestMRIntermediateDataEncryption.runMergeTest(TestMRIntermediateDataEncryption.java:161)
	at org.apache.hadoop.mapred.TestMRIntermediateDataEncryption.doEncryptionTest(TestMRIntermediateDataEncryption.java:95)
	at org.apache.hadoop.mapred.TestMRIntermediateDataEncryption.doEncryptionTest(TestMRIntermediateDataEncryption.java:75)
	at org.apache.hadoop.mapred.TestMRIntermediateDataEncryption.testMultipleMapsPerNode(TestMRIntermediateDataEncryption.java:65)


FAILED:  org.apache.hadoop.mapred.TestReduceFetchFromPartialMem.testReduceFromPartialMem

Error Message:
Job failed!

Stack Trace:
java.io.IOException: Job failed!
	at org.apache.hadoop.mapred.JobClient.runJob(JobClient.java:867)
	at org.apache.hadoop.mapred.TestReduceFetchFromPartialMem.runJob(TestReduceFetchFromPartialMem.java:300)
	at org.apache.hadoop.mapred.TestReduceFetchFromPartialMem.testReduceFromPartialMem(TestReduceFetchFromPartialMem.java:93)


FAILED:  org.apache.hadoop.mapred.TestReduceFetchFromPartialMem.testReduceFromPartialMem

Error Message:
Job failed!

Stack Trace:
java.io.IOException: Job failed!
	at org.apache.hadoop.mapred.JobClient.runJob(JobClient.java:867)
	at org.apache.hadoop.mapred.TestReduceFetchFromPartialMem.runJob(TestReduceFetchFromPartialMem.java:300)
	at org.apache.hadoop.mapred.TestReduceFetchFromPartialMem.testReduceFromPartialMem(TestReduceFetchFromPartialMem.java:93)



Mime
  • Unnamed multipart/mixed (inline, None, 0 bytes)
View raw message