hadoop-mapreduce-dev mailing list archives

Site index · List index
Message view « Date » · « Thread »
Top « Date » · « Thread »
From Apache Jenkins Server <jenk...@builds.apache.org>
Subject Hadoop-Mapreduce-trunk-Java8 - Build # 230 - Still Failing
Date Thu, 18 Jun 2015 21:31:20 GMT
See https://builds.apache.org/job/Hadoop-Mapreduce-trunk-Java8/230/

###################################################################################
########################## LAST 60 LINES OF THE CONSOLE ###########################
[...truncated 10920 lines...]
[INFO] ------------------------------------------------------------------------
[INFO] Reactor Summary:
[INFO] 
[INFO] Apache Hadoop MapReduce Client .................... SUCCESS [  2.235 s]
[INFO] Apache Hadoop MapReduce Core ...................... SUCCESS [01:10 min]
[INFO] Apache Hadoop MapReduce Common .................... SUCCESS [ 26.694 s]
[INFO] Apache Hadoop MapReduce Shuffle ................... SUCCESS [  4.276 s]
[INFO] Apache Hadoop MapReduce App ....................... SUCCESS [10:08 min]
[INFO] Apache Hadoop MapReduce HistoryServer ............. SUCCESS [06:09 min]
[INFO] Apache Hadoop MapReduce JobClient ................. FAILURE [  01:40 h]
[INFO] Apache Hadoop MapReduce HistoryServer Plugins ..... SKIPPED
[INFO] Apache Hadoop MapReduce NativeTask ................ SKIPPED
[INFO] Apache Hadoop MapReduce Examples .................. SKIPPED
[INFO] Apache Hadoop MapReduce ........................... SKIPPED
[INFO] ------------------------------------------------------------------------
[INFO] BUILD FAILURE
[INFO] ------------------------------------------------------------------------
[INFO] Total time: 01:58 h
[INFO] Finished at: 2015-06-18T21:30:51+00:00
[INFO] Final Memory: 34M/159M
[INFO] ------------------------------------------------------------------------
[ERROR] Failed to execute goal org.apache.maven.plugins:maven-surefire-plugin:2.17:test (default-test)
on project hadoop-mapreduce-client-jobclient: There are test failures.
[ERROR] 
[ERROR] Please refer to /home/jenkins/jenkins-slave/workspace/Hadoop-Mapreduce-trunk-Java8/hadoop-mapreduce-project/hadoop-mapreduce-client/hadoop-mapreduce-client-jobclient/target/surefire-reports
for the individual test results.
[ERROR] -> [Help 1]
[ERROR] 
[ERROR] To see the full stack trace of the errors, re-run Maven with the -e switch.
[ERROR] Re-run Maven using the -X switch to enable full debug logging.
[ERROR] 
[ERROR] For more information about the errors and possible solutions, please read the following
articles:
[ERROR] [Help 1] http://cwiki.apache.org/confluence/display/MAVEN/MojoFailureException
[ERROR] 
[ERROR] After correcting the problems, you can resume the build with the command
[ERROR]   mvn <goals> -rf :hadoop-mapreduce-client-jobclient
Build step 'Execute shell' marked build as failure
[FINDBUGS] Skipping publisher since build result is FAILURE
Archiving artifacts
Sending artifact delta relative to Hadoop-Mapreduce-trunk-Java8 #213
Archived 1 artifacts
Archive block size is 32768
Received 0 blocks and 20396825 bytes
Compression is 0.0%
Took 7.7 sec
Recording test results
Updating YARN-3804
Updating HADOOP-11965
Updating HDFS-8589
Updating HADOOP-12100
Updating YARN-3824
Updating HDFS-8605
Updating HDFS-8615
Updating HDFS-8446
Updating HADOOP-7139
Updating MAPREDUCE-6373
Updating HDFS-8238
Updating HDFS-7285
Updating HDFS-6249
Email was triggered for: Failure
Sending email for trigger: Failure



###################################################################################
############################## FAILED TESTS (if any) ##############################
4 tests failed.
FAILED:  org.apache.hadoop.mapred.TestReduceFetchFromPartialMem.testReduceFromPartialMem

Error Message:
Job failed!

Stack Trace:
java.io.IOException: Job failed!
	at org.apache.hadoop.mapred.JobClient.runJob(JobClient.java:867)
	at org.apache.hadoop.mapred.TestReduceFetchFromPartialMem.runJob(TestReduceFetchFromPartialMem.java:300)
	at org.apache.hadoop.mapred.TestReduceFetchFromPartialMem.testReduceFromPartialMem(TestReduceFetchFromPartialMem.java:93)


FAILED:  org.apache.hadoop.mapred.TestMRIntermediateDataEncryption.testMultipleMapsPerNode

Error Message:
expected:<8000> but was:<0>

Stack Trace:
java.lang.AssertionError: expected:<8000> but was:<0>
	at org.junit.Assert.fail(Assert.java:88)
	at org.junit.Assert.failNotEquals(Assert.java:743)
	at org.junit.Assert.assertEquals(Assert.java:118)
	at org.junit.Assert.assertEquals(Assert.java:555)
	at org.junit.Assert.assertEquals(Assert.java:542)
	at org.apache.hadoop.mapred.TestMRIntermediateDataEncryption.verifyOutput(TestMRIntermediateDataEncryption.java:200)
	at org.apache.hadoop.mapred.TestMRIntermediateDataEncryption.runMergeTest(TestMRIntermediateDataEncryption.java:161)
	at org.apache.hadoop.mapred.TestMRIntermediateDataEncryption.doEncryptionTest(TestMRIntermediateDataEncryption.java:95)
	at org.apache.hadoop.mapred.TestMRIntermediateDataEncryption.doEncryptionTest(TestMRIntermediateDataEncryption.java:75)
	at org.apache.hadoop.mapred.TestMRIntermediateDataEncryption.testMultipleMapsPerNode(TestMRIntermediateDataEncryption.java:65)


FAILED:  org.apache.hadoop.mapred.TestMerge.testMerge

Error Message:
expected:<10000> but was:<5000>

Stack Trace:
junit.framework.AssertionFailedError: expected:<10000> but was:<5000>
	at junit.framework.Assert.fail(Assert.java:57)
	at junit.framework.Assert.failNotEquals(Assert.java:329)
	at junit.framework.Assert.assertEquals(Assert.java:78)
	at junit.framework.Assert.assertEquals(Assert.java:159)
	at junit.framework.Assert.assertEquals(Assert.java:166)
	at junit.framework.TestCase.assertEquals(TestCase.java:324)
	at org.apache.hadoop.mapred.TestMerge.verifyOutput(TestMerge.java:186)
	at org.apache.hadoop.mapred.TestMerge.runMergeTest(TestMerge.java:146)
	at org.apache.hadoop.mapred.TestMerge.testMerge(TestMerge.java:87)


FAILED:  org.apache.hadoop.mapred.TestReduceFetchFromPartialMem.testReduceFromPartialMem

Error Message:
Job failed!

Stack Trace:
java.io.IOException: Job failed!
	at org.apache.hadoop.mapred.JobClient.runJob(JobClient.java:867)
	at org.apache.hadoop.mapred.TestReduceFetchFromPartialMem.runJob(TestReduceFetchFromPartialMem.java:300)
	at org.apache.hadoop.mapred.TestReduceFetchFromPartialMem.testReduceFromPartialMem(TestReduceFetchFromPartialMem.java:93)



Mime
  • Unnamed multipart/mixed (inline, None, 0 bytes)
View raw message