hadoop-mapreduce-dev mailing list archives

Site index · List index
Message view « Date » · « Thread »
Top « Date » · « Thread »
From Apache Jenkins Server <jenk...@builds.apache.org>
Subject Hadoop-Mapreduce-trunk-Java8 - Build # 216 - Still Failing
Date Thu, 04 Jun 2015 15:49:40 GMT
See https://builds.apache.org/job/Hadoop-Mapreduce-trunk-Java8/216/

###################################################################################
########################## LAST 60 LINES OF THE CONSOLE ###########################
[...truncated 10975 lines...]

[INFO] ------------------------------------------------------------------------
[INFO] Reactor Summary:
[INFO] 
[INFO] Apache Hadoop MapReduce Client .................... SUCCESS [  2.036 s]
[INFO] Apache Hadoop MapReduce Core ...................... SUCCESS [01:09 min]
[INFO] Apache Hadoop MapReduce Common .................... SUCCESS [ 25.361 s]
[INFO] Apache Hadoop MapReduce Shuffle ................... SUCCESS [  4.048 s]
[INFO] Apache Hadoop MapReduce App ....................... SUCCESS [10:31 min]
[INFO] Apache Hadoop MapReduce HistoryServer ............. SUCCESS [06:05 min]
[INFO] Apache Hadoop MapReduce JobClient ................. FAILURE [  01:45 h]
[INFO] Apache Hadoop MapReduce HistoryServer Plugins ..... SKIPPED
[INFO] Apache Hadoop MapReduce NativeTask ................ SKIPPED
[INFO] Apache Hadoop MapReduce Examples .................. SKIPPED
[INFO] Apache Hadoop MapReduce ........................... SKIPPED
[INFO] ------------------------------------------------------------------------
[INFO] BUILD FAILURE
[INFO] ------------------------------------------------------------------------
[INFO] Total time: 02:04 h
[INFO] Finished at: 2015-06-04T15:49:10+00:00
[INFO] Final Memory: 34M/155M
[INFO] ------------------------------------------------------------------------
[ERROR] Failed to execute goal org.apache.maven.plugins:maven-surefire-plugin:2.17:test (default-test)
on project hadoop-mapreduce-client-jobclient: There are test failures.
[ERROR] 
[ERROR] Please refer to /home/jenkins/jenkins-slave/workspace/Hadoop-Mapreduce-trunk-Java8/hadoop-mapreduce-project/hadoop-mapreduce-client/hadoop-mapreduce-client-jobclient/target/surefire-reports
for the individual test results.
[ERROR] -> [Help 1]
[ERROR] 
[ERROR] To see the full stack trace of the errors, re-run Maven with the -e switch.
[ERROR] Re-run Maven using the -X switch to enable full debug logging.
[ERROR] 
[ERROR] For more information about the errors and possible solutions, please read the following
articles:
[ERROR] [Help 1] http://cwiki.apache.org/confluence/display/MAVEN/MojoFailureException
[ERROR] 
[ERROR] After correcting the problems, you can resume the build with the command
[ERROR]   mvn <goals> -rf :hadoop-mapreduce-client-jobclient
Build step 'Execute shell' marked build as failure
[FINDBUGS] Skipping publisher since build result is FAILURE
Archiving artifacts
Sending artifact delta relative to Hadoop-Mapreduce-trunk-Java8 #213
Archived 1 artifacts
Archive block size is 32768
Received 0 blocks and 20393128 bytes
Compression is 0.0%
Took 7 sec
Recording test results
Updating YARN-3762
Updating MAPREDUCE-6382
Updating MAPREDUCE-5965
Updating MAPREDUCE-6174
Updating MAPREDUCE-6374
Updating YARN-3749
Updating YARN-41
Updating YARN-1462
Updating HADOOP-12018
Updating YARN-3751
Updating HADOOP-12019
Updating YARN-3585
Email was triggered for: Failure
Sending email for trigger: Failure



###################################################################################
############################## FAILED TESTS (if any) ##############################
7 tests failed.
REGRESSION:  org.apache.hadoop.mapred.TestMRIntermediateDataEncryption.testMultipleMapsPerNode

Error Message:
expected:<8000> but was:<0>

Stack Trace:
java.lang.AssertionError: expected:<8000> but was:<0>
	at org.junit.Assert.fail(Assert.java:88)
	at org.junit.Assert.failNotEquals(Assert.java:743)
	at org.junit.Assert.assertEquals(Assert.java:118)
	at org.junit.Assert.assertEquals(Assert.java:555)
	at org.junit.Assert.assertEquals(Assert.java:542)
	at org.apache.hadoop.mapred.TestMRIntermediateDataEncryption.verifyOutput(TestMRIntermediateDataEncryption.java:200)
	at org.apache.hadoop.mapred.TestMRIntermediateDataEncryption.runMergeTest(TestMRIntermediateDataEncryption.java:161)
	at org.apache.hadoop.mapred.TestMRIntermediateDataEncryption.doEncryptionTest(TestMRIntermediateDataEncryption.java:95)
	at org.apache.hadoop.mapred.TestMRIntermediateDataEncryption.doEncryptionTest(TestMRIntermediateDataEncryption.java:75)
	at org.apache.hadoop.mapred.TestMRIntermediateDataEncryption.testMultipleMapsPerNode(TestMRIntermediateDataEncryption.java:65)


REGRESSION:  org.apache.hadoop.mapred.TestMRTimelineEventHandling.testMapreduceJobTimelineServiceEnabled

Error Message:
Job didn't finish in 30 seconds

Stack Trace:
java.io.IOException: Job didn't finish in 30 seconds
	at org.apache.hadoop.mapred.UtilsForTests.runJobSucceed(UtilsForTests.java:622)
	at org.apache.hadoop.mapred.TestMRTimelineEventHandling.testMapreduceJobTimelineServiceEnabled(TestMRTimelineEventHandling.java:162)


REGRESSION:  org.apache.hadoop.mapred.TestMerge.testMerge

Error Message:
expected:<10000> but was:<2500>

Stack Trace:
junit.framework.AssertionFailedError: expected:<10000> but was:<2500>
	at junit.framework.Assert.fail(Assert.java:57)
	at junit.framework.Assert.failNotEquals(Assert.java:329)
	at junit.framework.Assert.assertEquals(Assert.java:78)
	at junit.framework.Assert.assertEquals(Assert.java:159)
	at junit.framework.Assert.assertEquals(Assert.java:166)
	at junit.framework.TestCase.assertEquals(TestCase.java:324)
	at org.apache.hadoop.mapred.TestMerge.verifyOutput(TestMerge.java:186)
	at org.apache.hadoop.mapred.TestMerge.runMergeTest(TestMerge.java:146)
	at org.apache.hadoop.mapred.TestMerge.testMerge(TestMerge.java:87)


REGRESSION:  org.apache.hadoop.mapred.TestMiniMRBringup.testBringUp

Error Message:
org.apache.hadoop.yarn.exceptions.YarnRuntimeException: Failed to intialize existing directories

Stack Trace:
org.apache.hadoop.yarn.exceptions.YarnRuntimeException: org.apache.hadoop.yarn.exceptions.YarnRuntimeException:
Failed to intialize existing directories
	at org.apache.hadoop.fs.RawLocalFileSystem.listStatus(RawLocalFileSystem.java:447)
	at org.apache.hadoop.fs.DelegateToFileSystem.listStatus(DelegateToFileSystem.java:153)
	at org.apache.hadoop.fs.ChecksumFs.listStatus(ChecksumFs.java:521)
	at org.apache.hadoop.fs.AbstractFileSystem$1.<init>(AbstractFileSystem.java:890)
	at org.apache.hadoop.fs.AbstractFileSystem.listStatusIterator(AbstractFileSystem.java:888)
	at org.apache.hadoop.fs.FileContext$22.next(FileContext.java:1485)
	at org.apache.hadoop.fs.FileContext$22.next(FileContext.java:1480)
	at org.apache.hadoop.fs.FSLinkResolver.resolve(FSLinkResolver.java:90)
	at org.apache.hadoop.fs.FileContext.listStatus(FileContext.java:1487)
	at org.apache.hadoop.mapreduce.v2.jobhistory.JobHistoryUtils.localGlobber(JobHistoryUtils.java:457)
	at org.apache.hadoop.mapreduce.v2.jobhistory.JobHistoryUtils.localGlobber(JobHistoryUtils.java:444)
	at org.apache.hadoop.mapreduce.v2.jobhistory.JobHistoryUtils.localGlobber(JobHistoryUtils.java:439)
	at org.apache.hadoop.mapreduce.v2.hs.HistoryFileManager.findTimestampedDirectories(HistoryFileManager.java:778)
	at org.apache.hadoop.mapreduce.v2.hs.HistoryFileManager.initExisting(HistoryFileManager.java:672)
	at org.apache.hadoop.mapreduce.v2.hs.JobHistory.serviceInit(JobHistory.java:97)
	at org.apache.hadoop.service.AbstractService.init(AbstractService.java:163)
	at org.apache.hadoop.service.CompositeService.serviceInit(CompositeService.java:107)
	at org.apache.hadoop.mapreduce.v2.hs.JobHistoryServer.serviceInit(JobHistoryServer.java:143)
	at org.apache.hadoop.service.AbstractService.init(AbstractService.java:163)
	at org.apache.hadoop.mapreduce.v2.MiniMRYarnCluster$JobHistoryServerWrapper.serviceStart(MiniMRYarnCluster.java:210)
	at org.apache.hadoop.service.AbstractService.start(AbstractService.java:193)
	at org.apache.hadoop.service.CompositeService.serviceStart(CompositeService.java:120)
	at org.apache.hadoop.service.AbstractService.start(AbstractService.java:193)
	at org.apache.hadoop.mapred.MiniMRClientClusterFactory.create(MiniMRClientClusterFactory.java:80)
	at org.apache.hadoop.mapred.MiniMRCluster.<init>(MiniMRCluster.java:187)
	at org.apache.hadoop.mapred.MiniMRCluster.<init>(MiniMRCluster.java:175)
	at org.apache.hadoop.mapred.MiniMRCluster.<init>(MiniMRCluster.java:167)
	at org.apache.hadoop.mapred.MiniMRCluster.<init>(MiniMRCluster.java:159)
	at org.apache.hadoop.mapred.MiniMRCluster.<init>(MiniMRCluster.java:152)
	at org.apache.hadoop.mapred.MiniMRCluster.<init>(MiniMRCluster.java:145)
	at org.apache.hadoop.mapred.MiniMRCluster.<init>(MiniMRCluster.java:138)
	at org.apache.hadoop.mapred.MiniMRCluster.<init>(MiniMRCluster.java:133)
	at org.apache.hadoop.mapred.TestMiniMRBringup.testBringUp(TestMiniMRBringup.java:32)


REGRESSION:  org.apache.hadoop.mapred.TestMiniMRClientCluster.testJob

Error Message:
null

Stack Trace:
java.lang.AssertionError: null
	at org.junit.Assert.fail(Assert.java:86)
	at org.junit.Assert.assertTrue(Assert.java:41)
	at org.junit.Assert.assertTrue(Assert.java:52)
	at org.apache.hadoop.mapred.TestMiniMRClientCluster.testJob(TestMiniMRClientCluster.java:162)


REGRESSION:  org.apache.hadoop.mapred.TestReduceFetchFromPartialMem.testReduceFromPartialMem

Error Message:
Job failed!

Stack Trace:
java.io.IOException: Job failed!
	at org.apache.hadoop.mapred.JobClient.runJob(JobClient.java:867)
	at org.apache.hadoop.mapred.TestReduceFetchFromPartialMem.runJob(TestReduceFetchFromPartialMem.java:300)
	at org.apache.hadoop.mapred.TestReduceFetchFromPartialMem.testReduceFromPartialMem(TestReduceFetchFromPartialMem.java:93)


REGRESSION:  org.apache.hadoop.mapred.TestReduceFetchFromPartialMem.testReduceFromPartialMem

Error Message:
Job failed!

Stack Trace:
java.io.IOException: Job failed!
	at org.apache.hadoop.mapred.JobClient.runJob(JobClient.java:867)
	at org.apache.hadoop.mapred.TestReduceFetchFromPartialMem.runJob(TestReduceFetchFromPartialMem.java:300)
	at org.apache.hadoop.mapred.TestReduceFetchFromPartialMem.testReduceFromPartialMem(TestReduceFetchFromPartialMem.java:93)



Mime
  • Unnamed multipart/mixed (inline, None, 0 bytes)
View raw message