hadoop-mapreduce-dev mailing list archives

Site index · List index
Message view « Date » · « Thread »
Top « Date » · « Thread »
From Apache Jenkins Server <jenk...@builds.apache.org>
Subject Hadoop-Mapreduce-trunk-Java8 - Build # 221 - Still Failing
Date Tue, 09 Jun 2015 15:06:49 GMT
See https://builds.apache.org/job/Hadoop-Mapreduce-trunk-Java8/221/

###################################################################################
########################## LAST 60 LINES OF THE CONSOLE ###########################
[...truncated 10947 lines...]

[INFO] ------------------------------------------------------------------------
[INFO] Reactor Summary:
[INFO] 
[INFO] Apache Hadoop MapReduce Client .................... SUCCESS [  2.356 s]
[INFO] Apache Hadoop MapReduce Core ...................... SUCCESS [01:11 min]
[INFO] Apache Hadoop MapReduce Common .................... SUCCESS [ 25.493 s]
[INFO] Apache Hadoop MapReduce Shuffle ................... SUCCESS [  4.043 s]
[INFO] Apache Hadoop MapReduce App ....................... SUCCESS [10:12 min]
[INFO] Apache Hadoop MapReduce HistoryServer ............. SUCCESS [06:05 min]
[INFO] Apache Hadoop MapReduce JobClient ................. FAILURE [  01:40 h]
[INFO] Apache Hadoop MapReduce HistoryServer Plugins ..... SKIPPED
[INFO] Apache Hadoop MapReduce NativeTask ................ SKIPPED
[INFO] Apache Hadoop MapReduce Examples .................. SKIPPED
[INFO] Apache Hadoop MapReduce ........................... SKIPPED
[INFO] ------------------------------------------------------------------------
[INFO] BUILD FAILURE
[INFO] ------------------------------------------------------------------------
[INFO] Total time: 01:58 h
[INFO] Finished at: 2015-06-09T15:06:22+00:00
[INFO] Final Memory: 34M/146M
[INFO] ------------------------------------------------------------------------
[ERROR] Failed to execute goal org.apache.maven.plugins:maven-surefire-plugin:2.17:test (default-test)
on project hadoop-mapreduce-client-jobclient: There are test failures.
[ERROR] 
[ERROR] Please refer to /home/jenkins/jenkins-slave/workspace/Hadoop-Mapreduce-trunk-Java8/hadoop-mapreduce-project/hadoop-mapreduce-client/hadoop-mapreduce-client-jobclient/target/surefire-reports
for the individual test results.
[ERROR] -> [Help 1]
[ERROR] 
[ERROR] To see the full stack trace of the errors, re-run Maven with the -e switch.
[ERROR] Re-run Maven using the -X switch to enable full debug logging.
[ERROR] 
[ERROR] For more information about the errors and possible solutions, please read the following
articles:
[ERROR] [Help 1] http://cwiki.apache.org/confluence/display/MAVEN/MojoFailureException
[ERROR] 
[ERROR] After correcting the problems, you can resume the build with the command
[ERROR]   mvn <goals> -rf :hadoop-mapreduce-client-jobclient
Build step 'Execute shell' marked build as failure
[FINDBUGS] Skipping publisher since build result is FAILURE
Archiving artifacts
Sending artifact delta relative to Hadoop-Mapreduce-trunk-Java8 #213
Archived 1 artifacts
Archive block size is 32768
Received 0 blocks and 20395056 bytes
Compression is 0.0%
Took 6.7 sec
Recording test results
Updating YARN-3787
Updating HDFS-8552
Updating HADOOP-12073
Updating MAPREDUCE-6392
Updating YARN-3786
Updating HDFS-8553
Updating YARN-3778
Updating HADOOP-11347
Updating HDFS-8554
Updating YARN-2716
Updating HADOOP-12054
Updating MAPREDUCE-6388
Email was triggered for: Failure
Sending email for trigger: Failure



###################################################################################
############################## FAILED TESTS (if any) ##############################
7 tests failed.
REGRESSION:  org.apache.hadoop.mapred.TestMRTimelineEventHandling.testMapreduceJobTimelineServiceEnabled

Error Message:
Job didn't finish in 30 seconds

Stack Trace:
java.io.IOException: Job didn't finish in 30 seconds
	at org.apache.hadoop.mapred.UtilsForTests.runJobSucceed(UtilsForTests.java:622)
	at org.apache.hadoop.mapred.TestMRTimelineEventHandling.testMapreduceJobTimelineServiceEnabled(TestMRTimelineEventHandling.java:201)


REGRESSION:  org.apache.hadoop.mapred.TestMerge.testMerge

Error Message:
expected:<10000> but was:<5000>

Stack Trace:
junit.framework.AssertionFailedError: expected:<10000> but was:<5000>
	at junit.framework.Assert.fail(Assert.java:57)
	at junit.framework.Assert.failNotEquals(Assert.java:329)
	at junit.framework.Assert.assertEquals(Assert.java:78)
	at junit.framework.Assert.assertEquals(Assert.java:159)
	at junit.framework.Assert.assertEquals(Assert.java:166)
	at junit.framework.TestCase.assertEquals(TestCase.java:324)
	at org.apache.hadoop.mapred.TestMerge.verifyOutput(TestMerge.java:186)
	at org.apache.hadoop.mapred.TestMerge.runMergeTest(TestMerge.java:146)
	at org.apache.hadoop.mapred.TestMerge.testMerge(TestMerge.java:87)


REGRESSION:  org.apache.hadoop.mapred.pipes.TestPipeApplication.testApplication

Error Message:
null

Stack Trace:
java.lang.NullPointerException: null
	at org.apache.hadoop.fs.permission.FsPermission.applyUMask(FsPermission.java:213)
	at org.apache.hadoop.fs.RawLocalFileSystem.mkOneDirWithMode(RawLocalFileSystem.java:496)
	at org.apache.hadoop.fs.RawLocalFileSystem.mkdirsWithOptionalPermission(RawLocalFileSystem.java:552)
	at org.apache.hadoop.fs.RawLocalFileSystem.mkdirs(RawLocalFileSystem.java:524)
	at org.apache.hadoop.fs.RawLocalFileSystem.create(RawLocalFileSystem.java:296)
	at org.apache.hadoop.fs.RawLocalFileSystem.create(RawLocalFileSystem.java:285)
	at org.apache.hadoop.fs.FileSystem.create(FileSystem.java:891)
	at org.apache.hadoop.fs.FileSystem.create(FileSystem.java:788)
	at org.apache.hadoop.fs.FileSystem.create(FileSystem.java:777)
	at org.apache.hadoop.mapred.pipes.TestPipeApplication.testApplication(TestPipeApplication.java:180)


REGRESSION:  org.apache.hadoop.mapred.pipes.TestPipeApplication.testRunner

Error Message:
null

Stack Trace:
java.lang.NullPointerException: null
	at org.apache.hadoop.fs.permission.FsPermission.applyUMask(FsPermission.java:213)
	at org.apache.hadoop.fs.RawLocalFileSystem.mkOneDirWithMode(RawLocalFileSystem.java:496)
	at org.apache.hadoop.fs.RawLocalFileSystem.mkdirsWithOptionalPermission(RawLocalFileSystem.java:552)
	at org.apache.hadoop.fs.RawLocalFileSystem.mkdirs(RawLocalFileSystem.java:524)
	at org.apache.hadoop.fs.RawLocalFileSystem.create(RawLocalFileSystem.java:296)
	at org.apache.hadoop.fs.RawLocalFileSystem.create(RawLocalFileSystem.java:285)
	at org.apache.hadoop.fs.FileSystem.create(FileSystem.java:891)
	at org.apache.hadoop.fs.FileSystem.create(FileSystem.java:788)
	at org.apache.hadoop.fs.FileSystem.create(FileSystem.java:777)
	at org.apache.hadoop.mapred.pipes.TestPipeApplication.testRunner(TestPipeApplication.java:98)


FAILED:  org.apache.hadoop.mapred.TestMiniMRClientCluster.testJob

Error Message:
null

Stack Trace:
java.lang.AssertionError: null
	at org.junit.Assert.fail(Assert.java:86)
	at org.junit.Assert.assertTrue(Assert.java:41)
	at org.junit.Assert.assertTrue(Assert.java:52)
	at org.apache.hadoop.mapred.TestMiniMRClientCluster.testJob(TestMiniMRClientCluster.java:162)


FAILED:  org.apache.hadoop.mapred.TestReduceFetchFromPartialMem.testReduceFromPartialMem

Error Message:
Job failed!

Stack Trace:
java.io.IOException: Job failed!
	at org.apache.hadoop.mapred.JobClient.runJob(JobClient.java:867)
	at org.apache.hadoop.mapred.TestReduceFetchFromPartialMem.runJob(TestReduceFetchFromPartialMem.java:300)
	at org.apache.hadoop.mapred.TestReduceFetchFromPartialMem.testReduceFromPartialMem(TestReduceFetchFromPartialMem.java:93)


FAILED:  org.apache.hadoop.mapred.TestReduceFetchFromPartialMem.testReduceFromPartialMem

Error Message:
Job failed!

Stack Trace:
java.io.IOException: Job failed!
	at org.apache.hadoop.mapred.JobClient.runJob(JobClient.java:867)
	at org.apache.hadoop.mapred.TestReduceFetchFromPartialMem.runJob(TestReduceFetchFromPartialMem.java:300)
	at org.apache.hadoop.mapred.TestReduceFetchFromPartialMem.testReduceFromPartialMem(TestReduceFetchFromPartialMem.java:93)



Mime
  • Unnamed multipart/mixed (inline, None, 0 bytes)
View raw message