hadoop-mapreduce-dev mailing list archives

Site index · List index
Message view « Date » · « Thread »
Top « Date » · « Thread »
From Apache Jenkins Server <jenk...@builds.apache.org>
Subject Hadoop-Mapreduce-trunk - Build # 2233 - Still Failing
Date Fri, 14 Aug 2015 14:03:20 GMT
See https://builds.apache.org/job/Hadoop-Mapreduce-trunk/2233/

###################################################################################
########################## LAST 60 LINES OF THE CONSOLE ###########################
[...truncated 32367 lines...]
[INFO] Reactor Summary:
[INFO] 
[INFO] Apache Hadoop MapReduce Client .................... SUCCESS [  2.752 s]
[INFO] Apache Hadoop MapReduce Core ...................... SUCCESS [01:32 min]
[INFO] Apache Hadoop MapReduce Common .................... SUCCESS [ 28.726 s]
[INFO] Apache Hadoop MapReduce Shuffle ................... SUCCESS [  4.546 s]
[INFO] Apache Hadoop MapReduce App ....................... FAILURE [08:35 min]
[INFO] Apache Hadoop MapReduce HistoryServer ............. SKIPPED
[INFO] Apache Hadoop MapReduce JobClient ................. SKIPPED
[INFO] Apache Hadoop MapReduce HistoryServer Plugins ..... SKIPPED
[INFO] Apache Hadoop MapReduce NativeTask ................ SKIPPED
[INFO] Apache Hadoop MapReduce Examples .................. SKIPPED
[INFO] Apache Hadoop MapReduce ........................... SKIPPED
[INFO] ------------------------------------------------------------------------
[INFO] BUILD FAILURE
[INFO] ------------------------------------------------------------------------
[INFO] Total time: 10:46 min
[INFO] Finished at: 2015-08-14T14:03:50+00:00
[INFO] Final Memory: 41M/825M
[INFO] ------------------------------------------------------------------------
[ERROR] Failed to execute goal org.apache.maven.plugins:maven-surefire-plugin:2.17:test (default-test)
on project hadoop-mapreduce-client-app: There are test failures.
[ERROR] 
[ERROR] Please refer to /home/jenkins/jenkins-slave/workspace/Hadoop-Mapreduce-trunk/hadoop-mapreduce-project/hadoop-mapreduce-client/hadoop-mapreduce-client-app/target/surefire-reports
for the individual test results.
[ERROR] -> [Help 1]
[ERROR] 
[ERROR] To see the full stack trace of the errors, re-run Maven with the -e switch.
[ERROR] Re-run Maven using the -X switch to enable full debug logging.
[ERROR] 
[ERROR] For more information about the errors and possible solutions, please read the following
articles:
[ERROR] [Help 1] http://cwiki.apache.org/confluence/display/MAVEN/MojoFailureException
[ERROR] 
[ERROR] After correcting the problems, you can resume the build with the command
[ERROR]   mvn <goals> -rf :hadoop-mapreduce-client-app
Build step 'Execute shell' marked build as failure
[FINDBUGS] Skipping publisher since build result is FAILURE
Archiving artifacts
Sending artifact delta relative to Hadoop-Mapreduce-trunk #2224
Archived 1 artifacts
Archive block size is 32768
Received 0 blocks and 20454151 bytes
Compression is 0.0%
Took 11 sec
Recording test results
Updating HDFS-8270
Updating HADOOP-10786
Updating HDFS-7235
Updating HDFS-7213
Updating HADOOP-7139
Updating HDFS-7225
Updating HDFS-7263
Updating YARN-4005
Updating HADOOP-12244
Updating YARN-3987
Updating HADOOP-12322
Updating HDFS-7649
Updating YARN-4047
Updating HADOOP-11333
Email was triggered for: Failure
Sending email for trigger: Failure



###################################################################################
############################## FAILED TESTS (if any) ##############################
2 tests failed.
FAILED:  org.apache.hadoop.mapreduce.v2.app.TestJobEndNotifier.checkConfiguration

Error Message:
Proxy should have been set but wasn't 

Stack Trace:
java.lang.AssertionError: Proxy should have been set but wasn't 
	at org.junit.Assert.fail(Assert.java:88)
	at org.junit.Assert.assertTrue(Assert.java:41)
	at org.apache.hadoop.mapreduce.v2.app.TestJobEndNotifier.testProxyConfiguration(TestJobEndNotifier.java:124)
	at org.apache.hadoop.mapreduce.v2.app.TestJobEndNotifier.checkConfiguration(TestJobEndNotifier.java:150)


FAILED:  org.apache.hadoop.mapreduce.v2.app.TestJobEndNotifier.testNotifyRetries

Error Message:
Should have taken more than 5 seconds it took 135

Stack Trace:
java.lang.AssertionError: Should have taken more than 5 seconds it took 135
	at org.junit.Assert.fail(Assert.java:88)
	at org.junit.Assert.assertTrue(Assert.java:41)
	at org.apache.hadoop.mapreduce.v2.app.TestJobEndNotifier.testNotifyRetries(TestJobEndNotifier.java:180)



Mime
  • Unnamed multipart/mixed (inline, None, 0 bytes)
View raw message