hadoop-mapreduce-dev mailing list archives

Site index · List index
Message view « Date » · « Thread »
Top « Date » · « Thread »
From Apache Jenkins Server <jenk...@builds.apache.org>
Subject Hadoop-Mapreduce-trunk - Build # 2222 - Failure
Date Mon, 03 Aug 2015 15:39:19 GMT
See https://builds.apache.org/job/Hadoop-Mapreduce-trunk/2222/

###################################################################################
########################## LAST 60 LINES OF THE CONSOLE ###########################
[...truncated 32904 lines...]
Tests run: 3, Failures: 0, Errors: 0, Skipped: 0, Time elapsed: 226.489 sec - in org.apache.hadoop.mapreduce.lib.output.TestJobOutputCommitter
Running org.apache.hadoop.mapreduce.lib.output.TestMRCJCFileOutputCommitter
Tests run: 4, Failures: 0, Errors: 0, Skipped: 0, Time elapsed: 1.516 sec - in org.apache.hadoop.mapreduce.lib.output.TestMRCJCFileOutputCommitter
Running org.apache.hadoop.util.TestMRCJCReflectionUtils
Tests run: 1, Failures: 0, Errors: 0, Skipped: 0, Time elapsed: 0.638 sec - in org.apache.hadoop.util.TestMRCJCReflectionUtils
Running org.apache.hadoop.util.TestMRCJCRunJar
Tests run: 1, Failures: 0, Errors: 0, Skipped: 0, Time elapsed: 0.255 sec - in org.apache.hadoop.util.TestMRCJCRunJar
Running org.apache.hadoop.io.TestSequenceFileMergeProgress
Tests run: 3, Failures: 0, Errors: 0, Skipped: 0, Time elapsed: 2.329 sec - in org.apache.hadoop.io.TestSequenceFileMergeProgress

Results :

Tests run: 517, Failures: 0, Errors: 0, Skipped: 11

[INFO] ------------------------------------------------------------------------
[INFO] Reactor Summary:
[INFO] 
[INFO] Apache Hadoop MapReduce Client .................... SUCCESS [  3.397 s]
[INFO] Apache Hadoop MapReduce Core ...................... SUCCESS [01:48 min]
[INFO] Apache Hadoop MapReduce Common .................... SUCCESS [ 32.536 s]
[INFO] Apache Hadoop MapReduce Shuffle ................... SUCCESS [  6.195 s]
[INFO] Apache Hadoop MapReduce App ....................... SUCCESS [09:27 min]
[INFO] Apache Hadoop MapReduce HistoryServer ............. SUCCESS [05:50 min]
[INFO] Apache Hadoop MapReduce JobClient ................. FAILURE [  01:49 h]
[INFO] Apache Hadoop MapReduce HistoryServer Plugins ..... SKIPPED
[INFO] Apache Hadoop MapReduce NativeTask ................ SKIPPED
[INFO] Apache Hadoop MapReduce Examples .................. SKIPPED
[INFO] Apache Hadoop MapReduce ........................... SKIPPED
[INFO] ------------------------------------------------------------------------
[INFO] BUILD FAILURE
[INFO] ------------------------------------------------------------------------
[INFO] Total time: 02:07 h
[INFO] Finished at: 2015-08-03T15:39:41+00:00
[INFO] Final Memory: 34M/713M
[INFO] ------------------------------------------------------------------------
[ERROR] Failed to execute goal org.apache.maven.plugins:maven-surefire-plugin:2.17:test (default-test)
on project hadoop-mapreduce-client-jobclient: ExecutionException: java.lang.RuntimeException:
The forked VM terminated without properly saying goodbye. VM crash or System.exit called?
[ERROR] Command was /bin/sh -c cd /home/jenkins/jenkins-slave/workspace/Hadoop-Mapreduce-trunk/hadoop-mapreduce-project/hadoop-mapreduce-client/hadoop-mapreduce-client-jobclient
&& /home/jenkins/tools/java/jdk1.7.0_55/jre/bin/java -Xmx4096m -XX:MaxPermSize=768m
-XX:+HeapDumpOnOutOfMemoryError -jar /home/jenkins/jenkins-slave/workspace/Hadoop-Mapreduce-trunk/hadoop-mapreduce-project/hadoop-mapreduce-client/hadoop-mapreduce-client-jobclient/target/surefire/surefirebooter913439278620536579.jar
/home/jenkins/jenkins-slave/workspace/Hadoop-Mapreduce-trunk/hadoop-mapreduce-project/hadoop-mapreduce-client/hadoop-mapreduce-client-jobclient/target/surefire/surefire2274703978009213810tmp
/home/jenkins/jenkins-slave/workspace/Hadoop-Mapreduce-trunk/hadoop-mapreduce-project/hadoop-mapreduce-client/hadoop-mapreduce-client-jobclient/target/surefire/surefire_2356087234297816949507tmp
[ERROR] -> [Help 1]
[ERROR] 
[ERROR] To see the full stack trace of the errors, re-run Maven with the -e switch.
[ERROR] Re-run Maven using the -X switch to enable full debug logging.
[ERROR] 
[ERROR] For more information about the errors and possible solutions, please read the following
articles:
[ERROR] [Help 1] http://cwiki.apache.org/confluence/display/MAVEN/MojoFailureException
[ERROR] 
[ERROR] After correcting the problems, you can resume the build with the command
[ERROR]   mvn <goals> -rf :hadoop-mapreduce-client-jobclient
Build step 'Execute shell' marked build as failure
[FINDBUGS] Skipping publisher since build result is FAILURE
Archiving artifacts
Sending artifact delta relative to Hadoop-Mapreduce-trunk #2221
Archived 1 artifacts
Archive block size is 32768
Received 0 blocks and 20451318 bytes
Compression is 0.0%
Took 5.6 sec
Recording test results
Email was triggered for: Failure
Sending email for trigger: Failure



###################################################################################
############################## FAILED TESTS (if any) ##############################
All tests passed
Mime
  • Unnamed multipart/mixed (inline, None, 0 bytes)
View raw message