hadoop-mapreduce-dev mailing list archives

Site index · List index
Message view « Date » · « Thread »
Top « Date » · « Thread »
From Apache Jenkins Server <jenk...@builds.apache.org>
Subject Hadoop-Mapreduce-trunk-Java8 - Build # 278 - Still Failing
Date Sat, 08 Aug 2015 15:15:47 GMT
See https://builds.apache.org/job/Hadoop-Mapreduce-trunk-Java8/278/

###################################################################################
########################## LAST 60 LINES OF THE CONSOLE ###########################
[...truncated 10669 lines...]
Running org.apache.hadoop.mapreduce.jobhistory.TestJobHistoryEventHandler
Tests run: 13, Failures: 0, Errors: 0, Skipped: 0, Time elapsed: 21.842 sec - in org.apache.hadoop.mapreduce.jobhistory.TestJobHistoryEventHandler
Java HotSpot(TM) 64-Bit Server VM warning: ignoring option MaxPermSize=768m; support was removed
in 8.0
Running org.apache.hadoop.mapreduce.jobhistory.TestJobSummary
Tests run: 1, Failures: 0, Errors: 0, Skipped: 0, Time elapsed: 0.369 sec - in org.apache.hadoop.mapreduce.jobhistory.TestJobSummary
Java HotSpot(TM) 64-Bit Server VM warning: ignoring option MaxPermSize=768m; support was removed
in 8.0
Running org.apache.hadoop.mapreduce.jobhistory.TestEvents
Tests run: 5, Failures: 0, Errors: 0, Skipped: 0, Time elapsed: 0.625 sec - in org.apache.hadoop.mapreduce.jobhistory.TestEvents

Results :

Tests run: 326, Failures: 0, Errors: 0, Skipped: 0

[INFO] ------------------------------------------------------------------------
[INFO] Reactor Summary:
[INFO] 
[INFO] Apache Hadoop MapReduce Client .................... SUCCESS [  2.053 s]
[INFO] Apache Hadoop MapReduce Core ...................... SUCCESS [01:17 min]
[INFO] Apache Hadoop MapReduce Common .................... SUCCESS [ 25.788 s]
[INFO] Apache Hadoop MapReduce Shuffle ................... SUCCESS [  3.914 s]
[INFO] Apache Hadoop MapReduce App ....................... FAILURE [24:34 min]
[INFO] Apache Hadoop MapReduce HistoryServer ............. SKIPPED
[INFO] Apache Hadoop MapReduce JobClient ................. SKIPPED
[INFO] Apache Hadoop MapReduce HistoryServer Plugins ..... SKIPPED
[INFO] Apache Hadoop MapReduce NativeTask ................ SKIPPED
[INFO] Apache Hadoop MapReduce Examples .................. SKIPPED
[INFO] Apache Hadoop MapReduce ........................... SKIPPED
[INFO] ------------------------------------------------------------------------
[INFO] BUILD FAILURE
[INFO] ------------------------------------------------------------------------
[INFO] Total time: 26:24 min
[INFO] Finished at: 2015-08-08T15:16:22+00:00
[INFO] Final Memory: 41M/258M
[INFO] ------------------------------------------------------------------------
[ERROR] Failed to execute goal org.apache.maven.plugins:maven-surefire-plugin:2.17:test (default-test)
on project hadoop-mapreduce-client-app: There was a timeout or other error in the fork ->
[Help 1]
[ERROR] 
[ERROR] To see the full stack trace of the errors, re-run Maven with the -e switch.
[ERROR] Re-run Maven using the -X switch to enable full debug logging.
[ERROR] 
[ERROR] For more information about the errors and possible solutions, please read the following
articles:
[ERROR] [Help 1] http://cwiki.apache.org/confluence/display/MAVEN/MojoFailureException
[ERROR] 
[ERROR] After correcting the problems, you can resume the build with the command
[ERROR]   mvn <goals> -rf :hadoop-mapreduce-client-app
Build step 'Execute shell' marked build as failure
[FINDBUGS] Skipping publisher since build result is FAILURE
Archiving artifacts
Sending artifact delta relative to Hadoop-Mapreduce-trunk-Java8 #276
Archived 1 artifacts
Archive block size is 32768
Received 0 blocks and 20462140 bytes
Compression is 0.0%
Took 5.4 sec
Recording test results
Updating HDFS-8772
Updating HDFS-8866
Updating YARN-3966
Email was triggered for: Failure
Sending email for trigger: Failure



###################################################################################
############################## FAILED TESTS (if any) ##############################
All tests passed
Mime
  • Unnamed multipart/mixed (inline, None, 0 bytes)
View raw message