hadoop-mapreduce-dev mailing list archives

Site index · List index
Message view « Date » · « Thread »
Top « Date » · « Thread »
From Apache Jenkins Server <jenk...@builds.apache.org>
Subject Hadoop-Mapreduce-trunk - Build # 2223 - Still Failing
Date Tue, 04 Aug 2015 14:21:33 GMT
See https://builds.apache.org/job/Hadoop-Mapreduce-trunk/2223/

###################################################################################
########################## LAST 60 LINES OF THE CONSOLE ###########################
[...truncated 32390 lines...]
Running org.apache.hadoop.mapreduce.v2.hs.TestHistoryFileManager
Tests run: 8, Failures: 0, Errors: 0, Skipped: 0, Time elapsed: 17.69 sec - in org.apache.hadoop.mapreduce.v2.hs.TestHistoryFileManager
Running org.apache.hadoop.mapreduce.v2.hs.TestJHSDelegationTokenSecretManager
Tests run: 1, Failures: 0, Errors: 0, Skipped: 0, Time elapsed: 0.65 sec - in org.apache.hadoop.mapreduce.v2.hs.TestJHSDelegationTokenSecretManager

Results :

Tests run: 194, Failures: 0, Errors: 0, Skipped: 0

[INFO] ------------------------------------------------------------------------
[INFO] Reactor Summary:
[INFO] 
[INFO] Apache Hadoop MapReduce Client .................... SUCCESS [  2.681 s]
[INFO] Apache Hadoop MapReduce Core ...................... SUCCESS [01:32 min]
[INFO] Apache Hadoop MapReduce Common .................... SUCCESS [ 28.324 s]
[INFO] Apache Hadoop MapReduce Shuffle ................... SUCCESS [  4.703 s]
[INFO] Apache Hadoop MapReduce App ....................... SUCCESS [09:04 min]
[INFO] Apache Hadoop MapReduce HistoryServer ............. FAILURE [05:21 min]
[INFO] Apache Hadoop MapReduce JobClient ................. SKIPPED
[INFO] Apache Hadoop MapReduce HistoryServer Plugins ..... SKIPPED
[INFO] Apache Hadoop MapReduce NativeTask ................ SKIPPED
[INFO] Apache Hadoop MapReduce Examples .................. SKIPPED
[INFO] Apache Hadoop MapReduce ........................... SKIPPED
[INFO] ------------------------------------------------------------------------
[INFO] BUILD FAILURE
[INFO] ------------------------------------------------------------------------
[INFO] Total time: 16:35 min
[INFO] Finished at: 2015-08-04T14:21:21+00:00
[INFO] Final Memory: 43M/786M
[INFO] ------------------------------------------------------------------------
[ERROR] Failed to execute goal org.apache.maven.plugins:maven-surefire-plugin:2.17:test (default-test)
on project hadoop-mapreduce-client-hs: ExecutionException: java.lang.RuntimeException: The
forked VM terminated without properly saying goodbye. VM crash or System.exit called?
[ERROR] Command was /bin/sh -c cd /home/jenkins/jenkins-slave/workspace/Hadoop-Mapreduce-trunk/hadoop-mapreduce-project/hadoop-mapreduce-client/hadoop-mapreduce-client-hs
&& /home/jenkins/tools/java/jdk1.7.0_55/jre/bin/java -Xmx4096m -XX:MaxPermSize=768m
-XX:+HeapDumpOnOutOfMemoryError -jar /home/jenkins/jenkins-slave/workspace/Hadoop-Mapreduce-trunk/hadoop-mapreduce-project/hadoop-mapreduce-client/hadoop-mapreduce-client-hs/target/surefire/surefirebooter8861930354772071083.jar
/home/jenkins/jenkins-slave/workspace/Hadoop-Mapreduce-trunk/hadoop-mapreduce-project/hadoop-mapreduce-client/hadoop-mapreduce-client-hs/target/surefire/surefire1733620387401184206tmp
/home/jenkins/jenkins-slave/workspace/Hadoop-Mapreduce-trunk/hadoop-mapreduce-project/hadoop-mapreduce-client/hadoop-mapreduce-client-hs/target/surefire/surefire_1297784234356395989798tmp
[ERROR] -> [Help 1]
[ERROR] 
[ERROR] To see the full stack trace of the errors, re-run Maven with the -e switch.
[ERROR] Re-run Maven using the -X switch to enable full debug logging.
[ERROR] 
[ERROR] For more information about the errors and possible solutions, please read the following
articles:
[ERROR] [Help 1] http://cwiki.apache.org/confluence/display/MAVEN/MojoFailureException
[ERROR] 
[ERROR] After correcting the problems, you can resume the build with the command
[ERROR]   mvn <goals> -rf :hadoop-mapreduce-client-hs
Build step 'Execute shell' marked build as failure
[FINDBUGS] Skipping publisher since build result is FAILURE
Archiving artifacts
Sending artifact delta relative to Hadoop-Mapreduce-trunk #2221
Archived 1 artifacts
Archive block size is 32768
Received 1 blocks and 20418877 bytes
Compression is 0.2%
Took 6.1 sec
Recording test results
Updating YARN-3978
Updating YARN-3543
Updating YARN-4004
Updating HDFS-8850
Updating YARN-3965
Email was triggered for: Failure
Sending email for trigger: Failure



###################################################################################
############################## FAILED TESTS (if any) ##############################
All tests passed
Mime
  • Unnamed multipart/mixed (inline, None, 0 bytes)
View raw message