hadoop-mapreduce-dev mailing list archives

Site index · List index
Message view « Date » · « Thread »
Top « Date » · « Thread »
From Apache Jenkins Server <jenk...@builds.apache.org>
Subject Hadoop-Mapreduce-trunk-Java8 - Build # 274 - Failure
Date Tue, 04 Aug 2015 16:31:30 GMT
See https://builds.apache.org/job/Hadoop-Mapreduce-trunk-Java8/274/

###################################################################################
########################## LAST 60 LINES OF THE CONSOLE ###########################
[...truncated 11401 lines...]

Results :

Failed tests: 
  TestTextInputFormat.testSplitableCodecs:223 Key in multiple partitions.

Tests run: 522, Failures: 1, Errors: 0, Skipped: 11

[INFO] ------------------------------------------------------------------------
[INFO] Reactor Summary:
[INFO] 
[INFO] Apache Hadoop MapReduce Client .................... SUCCESS [  2.661 s]
[INFO] Apache Hadoop MapReduce Core ...................... SUCCESS [01:18 min]
[INFO] Apache Hadoop MapReduce Common .................... SUCCESS [ 27.094 s]
[INFO] Apache Hadoop MapReduce Shuffle ................... SUCCESS [  3.912 s]
[INFO] Apache Hadoop MapReduce App ....................... SUCCESS [10:17 min]
[INFO] Apache Hadoop MapReduce HistoryServer ............. SUCCESS [06:04 min]
[INFO] Apache Hadoop MapReduce JobClient ................. FAILURE [  01:41 h]
[INFO] Apache Hadoop MapReduce HistoryServer Plugins ..... SKIPPED
[INFO] Apache Hadoop MapReduce NativeTask ................ SKIPPED
[INFO] Apache Hadoop MapReduce Examples .................. SKIPPED
[INFO] Apache Hadoop MapReduce ........................... SKIPPED
[INFO] ------------------------------------------------------------------------
[INFO] BUILD FAILURE
[INFO] ------------------------------------------------------------------------
[INFO] Total time: 01:59 h
[INFO] Finished at: 2015-08-04T16:30:32+00:00
[INFO] Final Memory: 35M/156M
[INFO] ------------------------------------------------------------------------
[ERROR] Failed to execute goal org.apache.maven.plugins:maven-surefire-plugin:2.17:test (default-test)
on project hadoop-mapreduce-client-jobclient: There are test failures.
[ERROR] 
[ERROR] Please refer to /home/jenkins/jenkins-slave/workspace/Hadoop-Mapreduce-trunk-Java8/hadoop-mapreduce-project/hadoop-mapreduce-client/hadoop-mapreduce-client-jobclient/target/surefire-reports
for the individual test results.
[ERROR] -> [Help 1]
[ERROR] 
[ERROR] To see the full stack trace of the errors, re-run Maven with the -e switch.
[ERROR] Re-run Maven using the -X switch to enable full debug logging.
[ERROR] 
[ERROR] For more information about the errors and possible solutions, please read the following
articles:
[ERROR] [Help 1] http://cwiki.apache.org/confluence/display/MAVEN/MojoFailureException
[ERROR] 
[ERROR] After correcting the problems, you can resume the build with the command
[ERROR]   mvn <goals> -rf :hadoop-mapreduce-client-jobclient
Build step 'Execute shell' marked build as failure
[FINDBUGS] Skipping publisher since build result is FAILURE
Archiving artifacts
Sending artifact delta relative to Hadoop-Mapreduce-trunk-Java8 #273
Archived 1 artifacts
Archive block size is 32768
Received 0 blocks and 20459246 bytes
Compression is 0.0%
Took 11 sec
Recording test results
Updating YARN-3978
Updating YARN-3543
Updating YARN-4004
Updating HDFS-8850
Updating YARN-3965
Email was triggered for: Failure
Sending email for trigger: Failure



###################################################################################
############################## FAILED TESTS (if any) ##############################
1 tests failed.
REGRESSION:  org.apache.hadoop.mapred.TestTextInputFormat.testSplitableCodecs

Error Message:
Key in multiple partitions.

Stack Trace:
java.lang.AssertionError: Key in multiple partitions.
	at org.junit.Assert.fail(Assert.java:88)
	at org.junit.Assert.assertTrue(Assert.java:41)
	at org.junit.Assert.assertFalse(Assert.java:64)
	at org.apache.hadoop.mapred.TestTextInputFormat.testSplitableCodecs(TestTextInputFormat.java:223)



Mime
  • Unnamed multipart/mixed (inline, None, 0 bytes)
View raw message