hadoop-mapreduce-dev mailing list archives

Site index · List index
Message view « Date » · « Thread »
Top « Date » · « Thread »
From Apache Jenkins Server <jenk...@builds.apache.org>
Subject Hadoop-Mapreduce-trunk - Build # 2220 - Still Failing
Date Sat, 01 Aug 2015 13:47:59 GMT
See https://builds.apache.org/job/Hadoop-Mapreduce-trunk/2220/

###################################################################################
########################## LAST 60 LINES OF THE CONSOLE ###########################
[...truncated 32487 lines...]

Results :

Tests run: 183, Failures: 0, Errors: 0, Skipped: 0

[INFO] ------------------------------------------------------------------------
[INFO] Reactor Summary:
[INFO] 
[INFO] Apache Hadoop MapReduce Client .................... SUCCESS [  2.853 s]
[INFO] Apache Hadoop MapReduce Core ...................... SUCCESS [01:33 min]
[INFO] Apache Hadoop MapReduce Common .................... SUCCESS [ 29.318 s]
[INFO] Apache Hadoop MapReduce Shuffle ................... SUCCESS [  4.769 s]
[INFO] Apache Hadoop MapReduce App ....................... SUCCESS [09:09 min]
[INFO] Apache Hadoop MapReduce HistoryServer ............. FAILURE [04:16 min]
[INFO] Apache Hadoop MapReduce JobClient ................. SKIPPED
[INFO] Apache Hadoop MapReduce HistoryServer Plugins ..... SKIPPED
[INFO] Apache Hadoop MapReduce NativeTask ................ SKIPPED
[INFO] Apache Hadoop MapReduce Examples .................. SKIPPED
[INFO] Apache Hadoop MapReduce ........................... SKIPPED
[INFO] ------------------------------------------------------------------------
[INFO] BUILD FAILURE
[INFO] ------------------------------------------------------------------------
[INFO] Total time: 15:38 min
[INFO] Finished at: 2015-08-01T13:47:19+00:00
[INFO] Final Memory: 43M/815M
[INFO] ------------------------------------------------------------------------
[ERROR] Failed to execute goal org.apache.maven.plugins:maven-surefire-plugin:2.17:test (default-test)
on project hadoop-mapreduce-client-hs: ExecutionException: java.lang.RuntimeException: The
forked VM terminated without properly saying goodbye. VM crash or System.exit called?
[ERROR] Command was /bin/sh -c cd /home/jenkins/jenkins-slave/workspace/Hadoop-Mapreduce-trunk/hadoop-mapreduce-project/hadoop-mapreduce-client/hadoop-mapreduce-client-hs
&& /home/jenkins/tools/java/jdk1.7.0_55/jre/bin/java -Xmx4096m -XX:MaxPermSize=768m
-XX:+HeapDumpOnOutOfMemoryError -jar /home/jenkins/jenkins-slave/workspace/Hadoop-Mapreduce-trunk/hadoop-mapreduce-project/hadoop-mapreduce-client/hadoop-mapreduce-client-hs/target/surefire/surefirebooter3044323463506074242.jar
/home/jenkins/jenkins-slave/workspace/Hadoop-Mapreduce-trunk/hadoop-mapreduce-project/hadoop-mapreduce-client/hadoop-mapreduce-client-hs/target/surefire/surefire5129001260754150452tmp
/home/jenkins/jenkins-slave/workspace/Hadoop-Mapreduce-trunk/hadoop-mapreduce-project/hadoop-mapreduce-client/hadoop-mapreduce-client-hs/target/surefire/surefire_117859088294828587767tmp
[ERROR] -> [Help 1]
[ERROR] 
[ERROR] To see the full stack trace of the errors, re-run Maven with the -e switch.
[ERROR] Re-run Maven using the -X switch to enable full debug logging.
[ERROR] 
[ERROR] For more information about the errors and possible solutions, please read the following
articles:
[ERROR] [Help 1] http://cwiki.apache.org/confluence/display/MAVEN/MojoFailureException
[ERROR] 
[ERROR] After correcting the problems, you can resume the build with the command
[ERROR]   mvn <goals> -rf :hadoop-mapreduce-client-hs
Build step 'Execute shell' marked build as failure
[FINDBUGS] Skipping publisher since build result is FAILURE
Archiving artifacts
Sending artifact delta relative to Hadoop-Mapreduce-trunk #2218
Archived 1 artifacts
Archive block size is 32768
Received 0 blocks and 20451008 bytes
Compression is 0.0%
Took 6.4 sec
Recording test results
Updating YARN-3990
Updating HDFS-8847
Updating HADOOP-12268
Updating HADOOP-7824
Updating MAPREDUCE-6394
Updating HADOOP-10854
Updating HDFS-6860
Updating HADOOP-12183
Updating HADOOP-12249
Email was triggered for: Failure
Sending email for trigger: Failure



###################################################################################
############################## FAILED TESTS (if any) ##############################
All tests passed
Mime
  • Unnamed multipart/mixed (inline, None, 0 bytes)
View raw message