hadoop-mapreduce-dev mailing list archives

Site index · List index
Message view « Date » · « Thread »
Top « Date » · « Thread »
From Apache Jenkins Server <jenk...@builds.apache.org>
Subject Hadoop-Mapreduce-trunk-Java8 - Build # 647 - Still Failing
Date Mon, 09 Nov 2015 19:35:13 GMT
See https://builds.apache.org/job/Hadoop-Mapreduce-trunk-Java8/647/

###################################################################################
########################## LAST 60 LINES OF THE CONSOLE ###########################
[...truncated 10095 lines...]
Tests run: 3, Failures: 0, Errors: 0, Skipped: 0, Time elapsed: 17.859 sec - in org.apache.hadoop.mapreduce.v2.app.TestFetchFailure
Java HotSpot(TM) 64-Bit Server VM warning: ignoring option MaxPermSize=768m; support was removed
in 8.0
Running org.apache.hadoop.mapreduce.jobhistory.TestJobSummary
Tests run: 1, Failures: 0, Errors: 0, Skipped: 0, Time elapsed: 0.356 sec - in org.apache.hadoop.mapreduce.jobhistory.TestJobSummary
Java HotSpot(TM) 64-Bit Server VM warning: ignoring option MaxPermSize=768m; support was removed
in 8.0
Running org.apache.hadoop.mapreduce.jobhistory.TestJobHistoryEventHandler
Tests run: 13, Failures: 0, Errors: 0, Skipped: 0, Time elapsed: 21.202 sec - in org.apache.hadoop.mapreduce.jobhistory.TestJobHistoryEventHandler
Java HotSpot(TM) 64-Bit Server VM warning: ignoring option MaxPermSize=768m; support was removed
in 8.0
Running org.apache.hadoop.mapreduce.jobhistory.TestEvents
Tests run: 5, Failures: 0, Errors: 0, Skipped: 0, Time elapsed: 0.64 sec - in org.apache.hadoop.mapreduce.jobhistory.TestEvents

Results :

Failed tests: 
  TestTaskAttempt.testMRAppHistoryForTAFailedInAssigned:177->testTaskAttemptAssignedKilledHistory:388
No Ta Started JH Event

Tests run: 340, Failures: 1, Errors: 0, Skipped: 0

[INFO] ------------------------------------------------------------------------
[INFO] Reactor Summary:
[INFO] 
[INFO] Apache Hadoop MapReduce Client .................... SUCCESS [  2.374 s]
[INFO] Apache Hadoop MapReduce Core ...................... SUCCESS [01:25 min]
[INFO] Apache Hadoop MapReduce Common .................... SUCCESS [ 25.661 s]
[INFO] Apache Hadoop MapReduce Shuffle ................... SUCCESS [  4.113 s]
[INFO] Apache Hadoop MapReduce App ....................... FAILURE [11:00 min]
[INFO] Apache Hadoop MapReduce HistoryServer ............. SKIPPED
[INFO] Apache Hadoop MapReduce JobClient ................. SKIPPED
[INFO] Apache Hadoop MapReduce HistoryServer Plugins ..... SKIPPED
[INFO] Apache Hadoop MapReduce NativeTask ................ SKIPPED
[INFO] Apache Hadoop MapReduce Examples .................. SKIPPED
[INFO] Apache Hadoop MapReduce ........................... SKIPPED
[INFO] ------------------------------------------------------------------------
[INFO] BUILD FAILURE
[INFO] ------------------------------------------------------------------------
[INFO] Total time: 12:58 min
[INFO] Finished at: 2015-11-09T19:35:20+00:00
[INFO] Final Memory: 40M/261M
[INFO] ------------------------------------------------------------------------
[ERROR] Failed to execute goal org.apache.maven.plugins:maven-surefire-plugin:2.17:test (default-test)
on project hadoop-mapreduce-client-app: There are test failures.
[ERROR] 
[ERROR] Please refer to /home/jenkins/jenkins-slave/workspace/Hadoop-Mapreduce-trunk-Java8/hadoop-mapreduce-project/hadoop-mapreduce-client/hadoop-mapreduce-client-app/target/surefire-reports
for the individual test results.
[ERROR] -> [Help 1]
[ERROR] 
[ERROR] To see the full stack trace of the errors, re-run Maven with the -e switch.
[ERROR] Re-run Maven using the -X switch to enable full debug logging.
[ERROR] 
[ERROR] For more information about the errors and possible solutions, please read the following
articles:
[ERROR] [Help 1] http://cwiki.apache.org/confluence/display/MAVEN/MojoFailureException
[ERROR] 
[ERROR] After correcting the problems, you can resume the build with the command
[ERROR]   mvn <goals> -rf :hadoop-mapreduce-client-app
Build step 'Execute shell' marked build as failure
[FINDBUGS] Skipping publisher since build result is FAILURE
Archiving artifacts
Recording test results
Updating YARN-3840
Email was triggered for: Failure - Any
Sending email for trigger: Failure - Any



###################################################################################
############################## FAILED TESTS (if any) ##############################
1 tests failed.
FAILED:  org.apache.hadoop.mapreduce.v2.app.job.impl.TestTaskAttempt.testMRAppHistoryForTAFailedInAssigned

Error Message:
No Ta Started JH Event

Stack Trace:
java.lang.AssertionError: No Ta Started JH Event
	at org.junit.Assert.fail(Assert.java:88)
	at org.junit.Assert.assertTrue(Assert.java:41)
	at org.apache.hadoop.mapreduce.v2.app.job.impl.TestTaskAttempt.testTaskAttemptAssignedKilledHistory(TestTaskAttempt.java:388)
	at org.apache.hadoop.mapreduce.v2.app.job.impl.TestTaskAttempt.testMRAppHistoryForTAFailedInAssigned(TestTaskAttempt.java:177)



Mime
  • Unnamed multipart/mixed (inline, None, 0 bytes)
View raw message