hadoop-mapreduce-dev mailing list archives

Site index · List index
Message view « Date » · « Thread »
Top « Date » · « Thread »
From Apache Jenkins Server <jenk...@builds.apache.org>
Subject Hadoop-Mapreduce-trunk - Build # 2608 - Still Failing
Date Sat, 14 Nov 2015 07:26:42 GMT
See https://builds.apache.org/job/Hadoop-Mapreduce-trunk/2608/

###################################################################################
########################## LAST 60 LINES OF THE CONSOLE ###########################
[...truncated 32268 lines...]
Running org.apache.hadoop.mapreduce.v2.app.webapp.TestAMWebServicesJobConf
Tests run: 4, Failures: 0, Errors: 0, Skipped: 0, Time elapsed: 10.964 sec - in org.apache.hadoop.mapreduce.v2.app.webapp.TestAMWebServicesJobConf
Running org.apache.hadoop.mapred.TestTaskAttemptListenerImpl
Tests run: 6, Failures: 0, Errors: 0, Skipped: 0, Time elapsed: 2.293 sec - in org.apache.hadoop.mapred.TestTaskAttemptListenerImpl
Running org.apache.hadoop.mapred.TestTaskAttemptFinishingMonitor
Tests run: 1, Failures: 0, Errors: 0, Skipped: 0, Time elapsed: 2.698 sec - in org.apache.hadoop.mapred.TestTaskAttemptFinishingMonitor
Running org.apache.hadoop.mapred.TestLocalContainerLauncher
Tests run: 2, Failures: 0, Errors: 0, Skipped: 0, Time elapsed: 3.299 sec - in org.apache.hadoop.mapred.TestLocalContainerLauncher

Results :

Failed tests: 
  TestTaskAttempt.testMRAppHistoryForTAFailedInAssigned:177->testTaskAttemptAssignedKilledHistory:388
No Ta Started JH Event

Tests run: 340, Failures: 1, Errors: 0, Skipped: 0

[INFO] ------------------------------------------------------------------------
[INFO] Reactor Summary:
[INFO] 
[INFO] Apache Hadoop MapReduce Client .................... SUCCESS [  5.427 s]
[INFO] Apache Hadoop MapReduce Core ...................... SUCCESS [02:59 min]
[INFO] Apache Hadoop MapReduce Common .................... SUCCESS [ 50.176 s]
[INFO] Apache Hadoop MapReduce Shuffle ................... SUCCESS [  9.285 s]
[INFO] Apache Hadoop MapReduce App ....................... FAILURE [12:39 min]
[INFO] Apache Hadoop MapReduce HistoryServer ............. SKIPPED
[INFO] Apache Hadoop MapReduce JobClient ................. SKIPPED
[INFO] Apache Hadoop MapReduce HistoryServer Plugins ..... SKIPPED
[INFO] Apache Hadoop MapReduce NativeTask ................ SKIPPED
[INFO] Apache Hadoop MapReduce Examples .................. SKIPPED
[INFO] Apache Hadoop MapReduce ........................... SKIPPED
[INFO] ------------------------------------------------------------------------
[INFO] BUILD FAILURE
[INFO] ------------------------------------------------------------------------
[INFO] Total time: 16:46 min
[INFO] Finished at: 2015-11-14T07:26:32+00:00
[INFO] Final Memory: 49M/1215M
[INFO] ------------------------------------------------------------------------
[ERROR] Failed to execute goal org.apache.maven.plugins:maven-surefire-plugin:2.17:test (default-test)
on project hadoop-mapreduce-client-app: There are test failures.
[ERROR] 
[ERROR] Please refer to /home/jenkins/jenkins-slave/workspace/Hadoop-Mapreduce-trunk/hadoop-mapreduce-project/hadoop-mapreduce-client/hadoop-mapreduce-client-app/target/surefire-reports
for the individual test results.
[ERROR] -> [Help 1]
[ERROR] 
[ERROR] To see the full stack trace of the errors, re-run Maven with the -e switch.
[ERROR] Re-run Maven using the -X switch to enable full debug logging.
[ERROR] 
[ERROR] For more information about the errors and possible solutions, please read the following
articles:
[ERROR] [Help 1] http://cwiki.apache.org/confluence/display/MAVEN/MojoFailureException
[ERROR] 
[ERROR] After correcting the problems, you can resume the build with the command
[ERROR]   mvn <goals> -rf :hadoop-mapreduce-client-app
Build step 'Execute shell' marked build as failure
[FINDBUGS] Skipping publisher since build result is FAILURE
Archiving artifacts
Recording test results
Updating HADOOP-12348
Updating HADOOP-12482
Updating HADOOP-11361
Email was triggered for: Failure - Any
Sending email for trigger: Failure - Any



###################################################################################
############################## FAILED TESTS (if any) ##############################
1 tests failed.
FAILED:  org.apache.hadoop.mapreduce.v2.app.job.impl.TestTaskAttempt.testMRAppHistoryForTAFailedInAssigned

Error Message:
No Ta Started JH Event

Stack Trace:
java.lang.AssertionError: No Ta Started JH Event
	at org.junit.Assert.fail(Assert.java:88)
	at org.junit.Assert.assertTrue(Assert.java:41)
	at org.apache.hadoop.mapreduce.v2.app.job.impl.TestTaskAttempt.testTaskAttemptAssignedKilledHistory(TestTaskAttempt.java:388)
	at org.apache.hadoop.mapreduce.v2.app.job.impl.TestTaskAttempt.testMRAppHistoryForTAFailedInAssigned(TestTaskAttempt.java:177)



Mime
  • Unnamed multipart/mixed (inline, None, 0 bytes)
View raw message