hadoop-mapreduce-dev mailing list archives

Site index · List index
Message view « Date » · « Thread »
Top « Date » · « Thread »
From Apache Jenkins Server <jenk...@builds.apache.org>
Subject Hadoop-Mapreduce-trunk - Build # 2665 - Still Failing
Date Wed, 25 Nov 2015 20:22:52 GMT
See https://builds.apache.org/job/Hadoop-Mapreduce-trunk/2665/

###################################################################################
########################## LAST 60 LINES OF THE CONSOLE ###########################
[...truncated 49875 lines...]
Tests run: 4, Failures: 0, Errors: 0, Skipped: 0, Time elapsed: 1.7 sec - in org.apache.hadoop.mapreduce.lib.output.TestMRCJCFileOutputCommitter
Running org.apache.hadoop.util.TestMRCJCReflectionUtils
Tests run: 1, Failures: 0, Errors: 0, Skipped: 0, Time elapsed: 0.689 sec - in org.apache.hadoop.util.TestMRCJCReflectionUtils
Running org.apache.hadoop.util.TestMRCJCRunJar
Tests run: 1, Failures: 0, Errors: 0, Skipped: 0, Time elapsed: 0.264 sec - in org.apache.hadoop.util.TestMRCJCRunJar
Running org.apache.hadoop.io.TestSequenceFileMergeProgress
Tests run: 3, Failures: 0, Errors: 0, Skipped: 0, Time elapsed: 2.358 sec - in org.apache.hadoop.io.TestSequenceFileMergeProgress

Results :

Tests in error: 
  TestMRJobs.testSleepJob:193->testSleepJobInternal:234 »  test timed out after ...
  TestMRJobs.testConfVerificationWithOutClassloader:321->testConfVerification:414 » 
  TestMRJobs.testRandomWriter:518 »  test timed out after 60000 milliseconds
  TestMRAppWithCombiner.setup:80 » NoClassDefFound org/apache/hadoop/service/Ser...
  TestMRAppWithCombiner.tearDown:93 » NoClassDefFound org/apache/hadoop/service/...

Tests run: 514, Failures: 0, Errors: 2, Skipped: 11

[INFO] ------------------------------------------------------------------------
[INFO] Reactor Summary:
[INFO] 
[INFO] Apache Hadoop MapReduce Client .................... SUCCESS [  2.913 s]
[INFO] Apache Hadoop MapReduce Core ...................... SUCCESS [01:40 min]
[INFO] Apache Hadoop MapReduce Common .................... SUCCESS [ 29.087 s]
[INFO] Apache Hadoop MapReduce Shuffle ................... SUCCESS [  4.858 s]
[INFO] Apache Hadoop MapReduce App ....................... SUCCESS [09:18 min]
[INFO] Apache Hadoop MapReduce HistoryServer ............. SUCCESS [05:40 min]
[INFO] Apache Hadoop MapReduce JobClient ................. FAILURE [  01:48 h]
[INFO] Apache Hadoop MapReduce HistoryServer Plugins ..... SKIPPED
[INFO] Apache Hadoop MapReduce NativeTask ................ SKIPPED
[INFO] Apache Hadoop MapReduce Examples .................. SKIPPED
[INFO] Apache Hadoop MapReduce ........................... SKIPPED
[INFO] ------------------------------------------------------------------------
[INFO] BUILD FAILURE
[INFO] ------------------------------------------------------------------------
[INFO] Total time: 02:05 h
[INFO] Finished at: 2015-11-25T20:22:35+00:00
[INFO] Final Memory: 34M/651M
[INFO] ------------------------------------------------------------------------
[ERROR] Failed to execute goal org.apache.maven.plugins:maven-surefire-plugin:2.17:test (default-test)
on project hadoop-mapreduce-client-jobclient: ExecutionException: java.lang.RuntimeException:
The forked VM terminated without properly saying goodbye. VM crash or System.exit called?
[ERROR] Command was /bin/sh -c cd /home/jenkins/jenkins-slave/workspace/Hadoop-Mapreduce-trunk/hadoop-mapreduce-project/hadoop-mapreduce-client/hadoop-mapreduce-client-jobclient
&& /home/jenkins/tools/java/jdk1.7.0_55/jre/bin/java -Xmx2048m -XX:MaxPermSize=768m
-XX:+HeapDumpOnOutOfMemoryError -jar /home/jenkins/jenkins-slave/workspace/Hadoop-Mapreduce-trunk/hadoop-mapreduce-project/hadoop-mapreduce-client/hadoop-mapreduce-client-jobclient/target/surefire/surefirebooter3826219276375096281.jar
/home/jenkins/jenkins-slave/workspace/Hadoop-Mapreduce-trunk/hadoop-mapreduce-project/hadoop-mapreduce-client/hadoop-mapreduce-client-jobclient/target/surefire/surefire5598475238850720813tmp
/home/jenkins/jenkins-slave/workspace/Hadoop-Mapreduce-trunk/hadoop-mapreduce-project/hadoop-mapreduce-client/hadoop-mapreduce-client-jobclient/target/surefire/surefire_2691998137990379958798tmp
[ERROR] -> [Help 1]
[ERROR] 
[ERROR] To see the full stack trace of the errors, re-run Maven with the -e switch.
[ERROR] Re-run Maven using the -X switch to enable full debug logging.
[ERROR] 
[ERROR] For more information about the errors and possible solutions, please read the following
articles:
[ERROR] [Help 1] http://cwiki.apache.org/confluence/display/MAVEN/MojoFailureException
[ERROR] 
[ERROR] After correcting the problems, you can resume the build with the command
[ERROR]   mvn <goals> -rf :hadoop-mapreduce-client-jobclient
Build step 'Execute shell' marked build as failure
[FINDBUGS] Skipping publisher since build result is FAILURE
Archiving artifacts
Recording test results
Updating HDFS-6694
Email was triggered for: Failure - Any
Sending email for trigger: Failure - Any



###################################################################################
############################## FAILED TESTS (if any) ##############################
2 tests failed.
FAILED:  org.apache.hadoop.mapreduce.v2.TestMRAppWithCombiner.org.apache.hadoop.mapreduce.v2.TestMRAppWithCombiner

Error Message:
org/apache/hadoop/service/ServiceOperations

Stack Trace:
java.lang.NoClassDefFoundError: org/apache/hadoop/service/ServiceOperations
	at java.net.URLClassLoader$1.run(URLClassLoader.java:366)
	at java.net.URLClassLoader$1.run(URLClassLoader.java:355)
	at java.security.AccessController.doPrivileged(Native Method)
	at java.net.URLClassLoader.findClass(URLClassLoader.java:354)
	at java.lang.ClassLoader.loadClass(ClassLoader.java:425)
	at sun.misc.Launcher$AppClassLoader.loadClass(Launcher.java:308)
	at java.lang.ClassLoader.loadClass(ClassLoader.java:358)
	at org.apache.hadoop.service.AbstractService.start(AbstractService.java:203)
	at org.apache.hadoop.service.CompositeService.serviceStart(CompositeService.java:120)
	at org.apache.hadoop.mapreduce.v2.MiniMRYarnCluster.serviceStart(MiniMRYarnCluster.java:191)
	at org.apache.hadoop.service.AbstractService.start(AbstractService.java:193)
	at org.apache.hadoop.mapreduce.v2.TestMRAppWithCombiner.setup(TestMRAppWithCombiner.java:80)


FAILED:  org.apache.hadoop.mapreduce.v2.TestMRAppWithCombiner.org.apache.hadoop.mapreduce.v2.TestMRAppWithCombiner

Error Message:
org/apache/hadoop/service/ServiceOperations

Stack Trace:
java.lang.NoClassDefFoundError: org/apache/hadoop/service/ServiceOperations
	at java.net.URLClassLoader$1.run(URLClassLoader.java:366)
	at java.net.URLClassLoader$1.run(URLClassLoader.java:355)
	at java.security.AccessController.doPrivileged(Native Method)
	at java.net.URLClassLoader.findClass(URLClassLoader.java:354)
	at java.lang.ClassLoader.loadClass(ClassLoader.java:425)
	at sun.misc.Launcher$AppClassLoader.loadClass(Launcher.java:308)
	at java.lang.ClassLoader.loadClass(ClassLoader.java:358)
	at org.apache.hadoop.service.CompositeService.stop(CompositeService.java:157)
	at org.apache.hadoop.service.CompositeService.serviceStop(CompositeService.java:131)
	at org.apache.hadoop.service.AbstractService.stop(AbstractService.java:221)
	at org.apache.hadoop.mapreduce.v2.TestMRAppWithCombiner.tearDown(TestMRAppWithCombiner.java:93)



Mime
  • Unnamed multipart/mixed (inline, None, 0 bytes)
View raw message