hadoop-mapreduce-dev mailing list archives

Site index · List index
Message view « Date » · « Thread »
Top « Date » · « Thread »
From Apache Jenkins Server <jenk...@builds.apache.org>
Subject Hadoop-Mapreduce-trunk-Java8 - Build # 678 - Still Failing
Date Wed, 18 Nov 2015 17:35:55 GMT
See https://builds.apache.org/job/Hadoop-Mapreduce-trunk-Java8/678/

###################################################################################
########################## LAST 60 LINES OF THE CONSOLE ###########################
[...truncated 10192 lines...]
Java HotSpot(TM) 64-Bit Server VM warning: ignoring option MaxPermSize=768m; support was removed
in 8.0
Running org.apache.hadoop.mapred.TestLocalContainerLauncher
Tests run: 2, Failures: 0, Errors: 0, Skipped: 0, Time elapsed: 1.534 sec - in org.apache.hadoop.mapred.TestLocalContainerLauncher

Results :

Failed tests: 
  TestMRAppMaster.testMRAppMasterMidLock:174 null

Tests in error: 
  TestAMWebApp.testCountersView:126 » Runtime java.util.zip.ZipException: error ...
  TestTaskAttemptListenerImpl.testGetMapCompletionEvents:189->createTce:244 » ExceptionInInitializer
  TestTaskAttemptListenerImpl.testCheckpointIDTracking:312 NoClassDefFound org/a...
  TestTaskAttemptListenerImpl.testCommitWindow:261 NoClassDefFound org/apache/ha...
  TestTaskAttemptListenerImpl.testStatusUpdateProgress:417 ExceptionInInitializer

Tests run: 324, Failures: 1, Errors: 5, Skipped: 0

[INFO] ------------------------------------------------------------------------
[INFO] Reactor Summary:
[INFO] 
[INFO] Apache Hadoop MapReduce Client .................... SUCCESS [  2.359 s]
[INFO] Apache Hadoop MapReduce Core ...................... SUCCESS [01:25 min]
[INFO] Apache Hadoop MapReduce Common .................... SUCCESS [ 26.783 s]
[INFO] Apache Hadoop MapReduce Shuffle ................... SUCCESS [  4.352 s]
[INFO] Apache Hadoop MapReduce App ....................... FAILURE [10:20 min]
[INFO] Apache Hadoop MapReduce HistoryServer ............. SKIPPED
[INFO] Apache Hadoop MapReduce JobClient ................. SKIPPED
[INFO] Apache Hadoop MapReduce HistoryServer Plugins ..... SKIPPED
[INFO] Apache Hadoop MapReduce NativeTask ................ SKIPPED
[INFO] Apache Hadoop MapReduce Examples .................. SKIPPED
[INFO] Apache Hadoop MapReduce ........................... SKIPPED
[INFO] ------------------------------------------------------------------------
[INFO] BUILD FAILURE
[INFO] ------------------------------------------------------------------------
[INFO] Total time: 12:21 min
[INFO] Finished at: 2015-11-18T17:35:50+00:00
[INFO] Final Memory: 40M/279M
[INFO] ------------------------------------------------------------------------
[ERROR] Failed to execute goal org.apache.maven.plugins:maven-surefire-plugin:2.17:test (default-test)
on project hadoop-mapreduce-client-app: ExecutionException: java.lang.RuntimeException: The
forked VM terminated without properly saying goodbye. VM crash or System.exit called?
[ERROR] Command was /bin/sh -c cd /home/jenkins/jenkins-slave/workspace/Hadoop-Mapreduce-trunk-Java8/hadoop-mapreduce-project/hadoop-mapreduce-client/hadoop-mapreduce-client-app
&& /home/jenkins/tools/java/jdk1.8.0/jre/bin/java -Xmx2048m -XX:MaxPermSize=768m -XX:+HeapDumpOnOutOfMemoryError
-jar /home/jenkins/jenkins-slave/workspace/Hadoop-Mapreduce-trunk-Java8/hadoop-mapreduce-project/hadoop-mapreduce-client/hadoop-mapreduce-client-app/target/surefire/surefirebooter1419603689342601638.jar
/home/jenkins/jenkins-slave/workspace/Hadoop-Mapreduce-trunk-Java8/hadoop-mapreduce-project/hadoop-mapreduce-client/hadoop-mapreduce-client-app/target/surefire/surefire9135335590311346397tmp
/home/jenkins/jenkins-slave/workspace/Hadoop-Mapreduce-trunk-Java8/hadoop-mapreduce-project/hadoop-mapreduce-client/hadoop-mapreduce-client-app/target/surefire/surefire_1044081536298489988040tmp
[ERROR] -> [Help 1]
[ERROR] 
[ERROR] To see the full stack trace of the errors, re-run Maven with the -e switch.
[ERROR] Re-run Maven using the -X switch to enable full debug logging.
[ERROR] 
[ERROR] For more information about the errors and possible solutions, please read the following
articles:
[ERROR] [Help 1] http://cwiki.apache.org/confluence/display/MAVEN/MojoFailureException
[ERROR] 
[ERROR] After correcting the problems, you can resume the build with the command
[ERROR]   mvn <goals> -rf :hadoop-mapreduce-client-app
Build step 'Execute shell' marked build as failure
[FINDBUGS] Skipping publisher since build result is FAILURE
Archiving artifacts
Recording test results
Updating HADOOP-8419
Updating HADOOP-12564
Email was triggered for: Failure - Any
Sending email for trigger: Failure - Any



###################################################################################
############################## FAILED TESTS (if any) ##############################
6 tests failed.
FAILED:  org.apache.hadoop.mapred.TestTaskAttemptListenerImpl.testGetMapCompletionEvents

Error Message:
null

Stack Trace:
java.lang.ExceptionInInitializerError: null
	at java.net.URLClassLoader$1.run(URLClassLoader.java:372)
	at java.net.URLClassLoader$1.run(URLClassLoader.java:361)
	at java.security.AccessController.doPrivileged(Native Method)
	at java.net.URLClassLoader.findClass(URLClassLoader.java:360)
	at java.lang.ClassLoader.loadClass(ClassLoader.java:424)
	at sun.misc.Launcher$AppClassLoader.loadClass(Launcher.java:308)
	at java.lang.ClassLoader.loadClass(ClassLoader.java:357)
	at java.lang.Class.forName0(Native Method)
	at java.lang.Class.forName(Class.java:259)
	at org.apache.hadoop.yarn.factory.providers.RecordFactoryProvider.getFactoryClassInstance(RecordFactoryProvider.java:57)
	at org.apache.hadoop.yarn.factory.providers.RecordFactoryProvider.getRecordFactory(RecordFactoryProvider.java:52)
	at org.apache.hadoop.yarn.util.Records.<clinit>(Records.java:32)
	at org.apache.hadoop.yarn.api.records.ApplicationId.newInstance(ApplicationId.java:49)
	at org.apache.hadoop.mapreduce.v2.util.MRBuilderUtils.newJobId(MRBuilderUtils.java:46)
	at org.apache.hadoop.mapred.TestTaskAttemptListenerImpl.createTce(TestTaskAttemptListenerImpl.java:244)
	at org.apache.hadoop.mapred.TestTaskAttemptListenerImpl.testGetMapCompletionEvents(TestTaskAttemptListenerImpl.java:189)


FAILED:  org.apache.hadoop.mapred.TestTaskAttemptListenerImpl.testCheckpointIDTracking

Error Message:
org/apache/hadoop/yarn/util/SystemClock

Stack Trace:
java.lang.NoClassDefFoundError: org/apache/hadoop/yarn/util/SystemClock
	at java.net.URLClassLoader$1.run(URLClassLoader.java:372)
	at java.net.URLClassLoader$1.run(URLClassLoader.java:361)
	at java.security.AccessController.doPrivileged(Native Method)
	at java.net.URLClassLoader.findClass(URLClassLoader.java:360)
	at java.lang.ClassLoader.loadClass(ClassLoader.java:424)
	at sun.misc.Launcher$AppClassLoader.loadClass(Launcher.java:308)
	at java.lang.ClassLoader.loadClass(ClassLoader.java:357)
	at org.apache.hadoop.mapred.TestTaskAttemptListenerImpl.testCheckpointIDTracking(TestTaskAttemptListenerImpl.java:312)


FAILED:  org.apache.hadoop.mapred.TestTaskAttemptListenerImpl.testCommitWindow

Error Message:
org/apache/hadoop/yarn/util/SystemClock

Stack Trace:
java.lang.NoClassDefFoundError: org/apache/hadoop/yarn/util/SystemClock
	at org.apache.hadoop.mapred.TestTaskAttemptListenerImpl.testCommitWindow(TestTaskAttemptListenerImpl.java:261)


FAILED:  org.apache.hadoop.mapred.TestTaskAttemptListenerImpl.testStatusUpdateProgress

Error Message:
null

Stack Trace:
java.lang.ExceptionInInitializerError: null
	at java.net.URLClassLoader$1.run(URLClassLoader.java:372)
	at java.net.URLClassLoader$1.run(URLClassLoader.java:361)
	at java.security.AccessController.doPrivileged(Native Method)
	at java.net.URLClassLoader.findClass(URLClassLoader.java:360)
	at java.lang.ClassLoader.loadClass(ClassLoader.java:424)
	at sun.misc.Launcher$AppClassLoader.loadClass(Launcher.java:308)
	at java.lang.ClassLoader.loadClass(ClassLoader.java:357)
	at java.lang.Class.forName0(Native Method)
	at java.lang.Class.forName(Class.java:259)
	at org.apache.hadoop.yarn.factory.providers.RecordFactoryProvider.getFactoryClassInstance(RecordFactoryProvider.java:57)
	at org.apache.hadoop.yarn.factory.providers.RecordFactoryProvider.getRecordFactory(RecordFactoryProvider.java:52)
	at org.apache.hadoop.mapreduce.TypeConverter.<clinit>(TypeConverter.java:63)
	at org.apache.hadoop.mapred.TestTaskAttemptListenerImpl.testStatusUpdateProgress(TestTaskAttemptListenerImpl.java:417)


FAILED:  org.apache.hadoop.mapreduce.v2.app.webapp.TestAMWebApp.testCountersView

Error Message:
java.util.zip.ZipException: error in opening zip file

Stack Trace:
java.lang.RuntimeException: java.util.zip.ZipException: error in opening zip file
	at java.util.zip.ZipFile.open(Native Method)
	at java.util.zip.ZipFile.<init>(ZipFile.java:220)
	at java.util.zip.ZipFile.<init>(ZipFile.java:150)
	at java.util.jar.JarFile.<init>(JarFile.java:166)
	at java.util.jar.JarFile.<init>(JarFile.java:103)
	at sun.net.www.protocol.jar.URLJarFile.<init>(URLJarFile.java:93)
	at sun.net.www.protocol.jar.URLJarFile.getJarFile(URLJarFile.java:69)
	at sun.net.www.protocol.jar.JarFileFactory.get(JarFileFactory.java:99)
	at sun.net.www.protocol.jar.JarURLConnection.connect(JarURLConnection.java:122)
	at sun.net.www.protocol.jar.JarURLConnection.getInputStream(JarURLConnection.java:150)
	at org.apache.hadoop.conf.Configuration.parse(Configuration.java:2543)
	at org.apache.hadoop.conf.Configuration.loadResource(Configuration.java:2614)
	at org.apache.hadoop.conf.Configuration.loadResources(Configuration.java:2567)
	at org.apache.hadoop.conf.Configuration.getProps(Configuration.java:2471)
	at org.apache.hadoop.conf.Configuration.set(Configuration.java:1207)
	at org.apache.hadoop.conf.Configuration.set(Configuration.java:1179)
	at org.apache.hadoop.mapreduce.v2.app.MockJobs.newJob(MockJobs.java:498)
	at org.apache.hadoop.mapreduce.v2.app.MockJobs.newJobs(MockJobs.java:142)
	at org.apache.hadoop.mapreduce.v2.app.MockAppContext.<init>(MockAppContext.java:67)
	at org.apache.hadoop.mapreduce.v2.app.MockAppContext.<init>(MockAppContext.java:60)
	at org.apache.hadoop.mapreduce.v2.app.webapp.TestAMWebApp.testCountersView(TestAMWebApp.java:126)


FAILED:  org.apache.hadoop.mapreduce.v2.app.TestMRAppMaster.testMRAppMasterMidLock

Error Message:
null

Stack Trace:
java.lang.AssertionError: null
	at org.junit.Assert.fail(Assert.java:86)
	at org.junit.Assert.assertTrue(Assert.java:41)
	at org.junit.Assert.assertTrue(Assert.java:52)
	at org.apache.hadoop.mapreduce.v2.app.TestMRAppMaster.testMRAppMasterMidLock(TestMRAppMaster.java:174)



Mime
  • Unnamed multipart/mixed (inline, None, 0 bytes)
View raw message