hadoop-mapreduce-dev mailing list archives

Site index · List index
Message view « Date » · « Thread »
Top « Date » · « Thread »
From Apache Jenkins Server <jenk...@builds.apache.org>
Subject Hadoop-Mapreduce-trunk-Java8 - Build # 688 - Still Failing
Date Fri, 20 Nov 2015 00:55:30 GMT
See https://builds.apache.org/job/Hadoop-Mapreduce-trunk-Java8/688/

###################################################################################
########################## LAST 60 LINES OF THE CONSOLE ###########################
[...truncated 10182 lines...]
Tests run: 13, Failures: 0, Errors: 0, Skipped: 0, Time elapsed: 21.725 sec - in org.apache.hadoop.mapreduce.jobhistory.TestJobHistoryEventHandler
Java HotSpot(TM) 64-Bit Server VM warning: ignoring option MaxPermSize=768m; support was removed
in 8.0
Running org.apache.hadoop.mapreduce.jobhistory.TestEvents
Tests run: 5, Failures: 0, Errors: 0, Skipped: 0, Time elapsed: 0.634 sec - in org.apache.hadoop.mapreduce.jobhistory.TestEvents

Results :

Failed tests: 
  TestMRAppMaster.testMRAppMasterMidLock:174 null

Tests in error: 
  TestRMContainerAllocator.testUnregistrationOnlyIfRegistered:2410 » NoClassDefFound
  TestJobEndNotifier.testNotificationOnLastRetryNormalShutdown:204 » NoClassDefFound
  TestJobEndNotifier.testAbsentNotificationOnNotLastRetryUnregistrationFailure:227 » NoClassDefFound
  TestJobEndNotifier.testNotificationOnLastRetryUnregistrationFailure:254 » NoClassDefFound
  TestMRAppMaster.testMRAppMasterSuccessLock:254 » YarnRuntime java.io.FileNotFo...

Tests run: 314, Failures: 1, Errors: 4, Skipped: 0

[INFO] ------------------------------------------------------------------------
[INFO] Reactor Summary:
[INFO] 
[INFO] Apache Hadoop MapReduce Client .................... SUCCESS [  2.152 s]
[INFO] Apache Hadoop MapReduce Core ...................... SUCCESS [01:24 min]
[INFO] Apache Hadoop MapReduce Common .................... SUCCESS [ 25.699 s]
[INFO] Apache Hadoop MapReduce Shuffle ................... SUCCESS [  4.024 s]
[INFO] Apache Hadoop MapReduce App ....................... FAILURE [10:36 min]
[INFO] Apache Hadoop MapReduce HistoryServer ............. SKIPPED
[INFO] Apache Hadoop MapReduce JobClient ................. SKIPPED
[INFO] Apache Hadoop MapReduce HistoryServer Plugins ..... SKIPPED
[INFO] Apache Hadoop MapReduce NativeTask ................ SKIPPED
[INFO] Apache Hadoop MapReduce Examples .................. SKIPPED
[INFO] Apache Hadoop MapReduce ........................... SKIPPED
[INFO] ------------------------------------------------------------------------
[INFO] BUILD FAILURE
[INFO] ------------------------------------------------------------------------
[INFO] Total time: 12:33 min
[INFO] Finished at: 2015-11-20T00:55:27+00:00
[INFO] Final Memory: 40M/272M
[INFO] ------------------------------------------------------------------------
[ERROR] Failed to execute goal org.apache.maven.plugins:maven-surefire-plugin:2.17:test (default-test)
on project hadoop-mapreduce-client-app: ExecutionException: java.lang.RuntimeException: The
forked VM terminated without properly saying goodbye. VM crash or System.exit called?
[ERROR] Command was /bin/sh -c cd /home/jenkins/jenkins-slave/workspace/Hadoop-Mapreduce-trunk-Java8/hadoop-mapreduce-project/hadoop-mapreduce-client/hadoop-mapreduce-client-app
&& /home/jenkins/tools/java/jdk1.8.0/jre/bin/java -Xmx2048m -XX:MaxPermSize=768m -XX:+HeapDumpOnOutOfMemoryError
-jar /home/jenkins/jenkins-slave/workspace/Hadoop-Mapreduce-trunk-Java8/hadoop-mapreduce-project/hadoop-mapreduce-client/hadoop-mapreduce-client-app/target/surefire/surefirebooter8217331750802567668.jar
/home/jenkins/jenkins-slave/workspace/Hadoop-Mapreduce-trunk-Java8/hadoop-mapreduce-project/hadoop-mapreduce-client/hadoop-mapreduce-client-app/target/surefire/surefire8682150070512683172tmp
/home/jenkins/jenkins-slave/workspace/Hadoop-Mapreduce-trunk-Java8/hadoop-mapreduce-project/hadoop-mapreduce-client/hadoop-mapreduce-client-app/target/surefire/surefire_723081302499854342378tmp
[ERROR] -> [Help 1]
[ERROR] 
[ERROR] To see the full stack trace of the errors, re-run Maven with the -e switch.
[ERROR] Re-run Maven using the -X switch to enable full debug logging.
[ERROR] 
[ERROR] For more information about the errors and possible solutions, please read the following
articles:
[ERROR] [Help 1] http://cwiki.apache.org/confluence/display/MAVEN/MojoFailureException
[ERROR] 
[ERROR] After correcting the problems, you can resume the build with the command
[ERROR]   mvn <goals> -rf :hadoop-mapreduce-client-app
Build step 'Execute shell' marked build as failure
[FINDBUGS] Skipping publisher since build result is FAILURE
Archiving artifacts
Recording test results
Updating HADOOP-12584
Email was triggered for: Failure - Any
Sending email for trigger: Failure - Any



###################################################################################
############################## FAILED TESTS (if any) ##############################
5 tests failed.
FAILED:  org.apache.hadoop.mapreduce.v2.app.TestJobEndNotifier.testNotificationOnLastRetryNormalShutdown

Error Message:
org/apache/hadoop/yarn/event/EventHandler

Stack Trace:
java.lang.NoClassDefFoundError: org/apache/hadoop/yarn/event/EventHandler
	at java.net.URLClassLoader$1.run(URLClassLoader.java:372)
	at java.net.URLClassLoader$1.run(URLClassLoader.java:361)
	at java.security.AccessController.doPrivileged(Native Method)
	at java.net.URLClassLoader.findClass(URLClassLoader.java:360)
	at java.lang.ClassLoader.loadClass(ClassLoader.java:424)
	at sun.misc.Launcher$AppClassLoader.loadClass(Launcher.java:308)
	at java.lang.ClassLoader.loadClass(ClassLoader.java:357)
	at java.lang.ClassLoader.defineClass1(Native Method)
	at java.lang.ClassLoader.defineClass(ClassLoader.java:760)
	at java.security.SecureClassLoader.defineClass(SecureClassLoader.java:142)
	at java.net.URLClassLoader.defineClass(URLClassLoader.java:455)
	at java.net.URLClassLoader.access$100(URLClassLoader.java:73)
	at java.net.URLClassLoader$1.run(URLClassLoader.java:367)
	at java.net.URLClassLoader$1.run(URLClassLoader.java:361)
	at java.security.AccessController.doPrivileged(Native Method)
	at java.net.URLClassLoader.findClass(URLClassLoader.java:360)
	at java.lang.ClassLoader.loadClass(ClassLoader.java:424)
	at sun.misc.Launcher$AppClassLoader.loadClass(Launcher.java:308)
	at java.lang.ClassLoader.loadClass(ClassLoader.java:357)
	at org.apache.hadoop.mapreduce.v2.app.TestJobEndNotifier.testNotificationOnLastRetryNormalShutdown(TestJobEndNotifier.java:204)


FAILED:  org.apache.hadoop.mapreduce.v2.app.TestJobEndNotifier.testAbsentNotificationOnNotLastRetryUnregistrationFailure

Error Message:
org/apache/hadoop/yarn/event/EventHandler

Stack Trace:
java.lang.NoClassDefFoundError: org/apache/hadoop/yarn/event/EventHandler
	at java.net.URLClassLoader$1.run(URLClassLoader.java:372)
	at java.net.URLClassLoader$1.run(URLClassLoader.java:361)
	at java.security.AccessController.doPrivileged(Native Method)
	at java.net.URLClassLoader.findClass(URLClassLoader.java:360)
	at java.lang.ClassLoader.loadClass(ClassLoader.java:424)
	at sun.misc.Launcher$AppClassLoader.loadClass(Launcher.java:308)
	at java.lang.ClassLoader.loadClass(ClassLoader.java:357)
	at java.lang.ClassLoader.defineClass1(Native Method)
	at java.lang.ClassLoader.defineClass(ClassLoader.java:760)
	at java.security.SecureClassLoader.defineClass(SecureClassLoader.java:142)
	at java.net.URLClassLoader.defineClass(URLClassLoader.java:455)
	at java.net.URLClassLoader.access$100(URLClassLoader.java:73)
	at java.net.URLClassLoader$1.run(URLClassLoader.java:367)
	at java.net.URLClassLoader$1.run(URLClassLoader.java:361)
	at java.security.AccessController.doPrivileged(Native Method)
	at java.net.URLClassLoader.findClass(URLClassLoader.java:360)
	at java.lang.ClassLoader.loadClass(ClassLoader.java:424)
	at sun.misc.Launcher$AppClassLoader.loadClass(Launcher.java:308)
	at java.lang.ClassLoader.loadClass(ClassLoader.java:357)
	at org.apache.hadoop.mapreduce.v2.app.TestJobEndNotifier.testAbsentNotificationOnNotLastRetryUnregistrationFailure(TestJobEndNotifier.java:227)


FAILED:  org.apache.hadoop.mapreduce.v2.app.TestJobEndNotifier.testNotificationOnLastRetryUnregistrationFailure

Error Message:
org/apache/hadoop/yarn/event/EventHandler

Stack Trace:
java.lang.NoClassDefFoundError: org/apache/hadoop/yarn/event/EventHandler
	at java.net.URLClassLoader$1.run(URLClassLoader.java:372)
	at java.net.URLClassLoader$1.run(URLClassLoader.java:361)
	at java.security.AccessController.doPrivileged(Native Method)
	at java.net.URLClassLoader.findClass(URLClassLoader.java:360)
	at java.lang.ClassLoader.loadClass(ClassLoader.java:424)
	at sun.misc.Launcher$AppClassLoader.loadClass(Launcher.java:308)
	at java.lang.ClassLoader.loadClass(ClassLoader.java:357)
	at java.lang.ClassLoader.defineClass1(Native Method)
	at java.lang.ClassLoader.defineClass(ClassLoader.java:760)
	at java.security.SecureClassLoader.defineClass(SecureClassLoader.java:142)
	at java.net.URLClassLoader.defineClass(URLClassLoader.java:455)
	at java.net.URLClassLoader.access$100(URLClassLoader.java:73)
	at java.net.URLClassLoader$1.run(URLClassLoader.java:367)
	at java.net.URLClassLoader$1.run(URLClassLoader.java:361)
	at java.security.AccessController.doPrivileged(Native Method)
	at java.net.URLClassLoader.findClass(URLClassLoader.java:360)
	at java.lang.ClassLoader.loadClass(ClassLoader.java:424)
	at sun.misc.Launcher$AppClassLoader.loadClass(Launcher.java:308)
	at java.lang.ClassLoader.loadClass(ClassLoader.java:357)
	at org.apache.hadoop.mapreduce.v2.app.TestJobEndNotifier.testNotificationOnLastRetryUnregistrationFailure(TestJobEndNotifier.java:254)


FAILED:  org.apache.hadoop.mapreduce.v2.app.TestMRAppMaster.testMRAppMasterSuccessLock

Error Message:
java.io.FileNotFoundException: File file:/home/jenkins/jenkins-slave/workspace/Hadoop-Mapreduce-trunk-Java8/hadoop-mapreduce-project/hadoop-mapreduce-client/hadoop-mapreduce-client-app/staging/history/done_intermediate/TestAppMasterUser/job_1317529182569_0004_conf.xml_tmp
does not exist

Stack Trace:
org.apache.hadoop.yarn.exceptions.YarnRuntimeException: java.io.FileNotFoundException: File
file:/home/jenkins/jenkins-slave/workspace/Hadoop-Mapreduce-trunk-Java8/hadoop-mapreduce-project/hadoop-mapreduce-client/hadoop-mapreduce-client-app/staging/history/done_intermediate/TestAppMasterUser/job_1317529182569_0004_conf.xml_tmp
does not exist
	at org.apache.hadoop.fs.RawLocalFileSystem.deprecatedGetFileStatus(RawLocalFileSystem.java:640)
	at org.apache.hadoop.fs.RawLocalFileSystem.getFileLinkStatusInternal(RawLocalFileSystem.java:866)
	at org.apache.hadoop.fs.RawLocalFileSystem.getFileStatus(RawLocalFileSystem.java:630)
	at org.apache.hadoop.fs.FileUtil.copy(FileUtil.java:340)
	at org.apache.hadoop.fs.FileUtil.copy(FileUtil.java:292)
	at org.apache.hadoop.fs.RawLocalFileSystem.rename(RawLocalFileSystem.java:372)
	at org.apache.hadoop.fs.ChecksumFileSystem.rename(ChecksumFileSystem.java:513)
	at org.apache.hadoop.mapreduce.jobhistory.JobHistoryEventHandler.moveTmpToDone(JobHistoryEventHandler.java:1346)
	at org.apache.hadoop.mapreduce.jobhistory.JobHistoryEventHandler.processDoneFiles(JobHistoryEventHandler.java:1153)
	at org.apache.hadoop.service.ServiceOperations.stop(ServiceOperations.java:52)
	at org.apache.hadoop.service.ServiceOperations.stopQuietly(ServiceOperations.java:80)
	at org.apache.hadoop.service.CompositeService.stop(CompositeService.java:157)
	at org.apache.hadoop.service.CompositeService.serviceStop(CompositeService.java:131)
	at org.apache.hadoop.mapreduce.v2.app.MRAppMaster.serviceStop(MRAppMaster.java:1751)
	at org.apache.hadoop.service.AbstractService.stop(AbstractService.java:221)
	at org.apache.hadoop.mapreduce.v2.app.MRAppMaster.stop(MRAppMaster.java:1247)
	at org.apache.hadoop.mapreduce.v2.app.TestMRAppMaster.testMRAppMasterSuccessLock(TestMRAppMaster.java:254)


FAILED:  org.apache.hadoop.mapreduce.v2.app.TestMRAppMaster.testMRAppMasterMidLock

Error Message:
null

Stack Trace:
java.lang.AssertionError: null
	at org.junit.Assert.fail(Assert.java:86)
	at org.junit.Assert.assertTrue(Assert.java:41)
	at org.junit.Assert.assertTrue(Assert.java:52)
	at org.apache.hadoop.mapreduce.v2.app.TestMRAppMaster.testMRAppMasterMidLock(TestMRAppMaster.java:174)



Mime
  • Unnamed multipart/mixed (inline, None, 0 bytes)
View raw message