hadoop-mapreduce-dev mailing list archives

Site index · List index
Message view « Date » · « Thread »
Top « Date » · « Thread »
From Apache Jenkins Server <jenk...@builds.apache.org>
Subject Hadoop-Mapreduce-trunk - Build # 2584 - Still Failing
Date Sun, 08 Nov 2015 23:09:36 GMT
See https://builds.apache.org/job/Hadoop-Mapreduce-trunk/2584/

###################################################################################
########################## LAST 60 LINES OF THE CONSOLE ###########################
[...truncated 32799 lines...]
Tests run: 12, Failures: 0, Errors: 0, Skipped: 0, Time elapsed: 351.658 sec - in org.apache.hadoop.mapreduce.v2.TestUberAM
Running org.apache.hadoop.mapreduce.v2.TestMRJobsWithHistoryService
Tests run: 1, Failures: 0, Errors: 0, Skipped: 0, Time elapsed: 66.355 sec - in org.apache.hadoop.mapreduce.v2.TestMRJobsWithHistoryService
Running org.apache.hadoop.mapreduce.v2.TestMRAMWithNonNormalizedCapabilities
Tests run: 1, Failures: 0, Errors: 0, Skipped: 0, Time elapsed: 61.977 sec - in org.apache.hadoop.mapreduce.v2.TestMRAMWithNonNormalizedCapabilities
Running org.apache.hadoop.mapreduce.TestValueIterReset
Tests run: 1, Failures: 0, Errors: 0, Skipped: 0, Time elapsed: 3.53 sec - in org.apache.hadoop.mapreduce.TestValueIterReset
Running org.apache.hadoop.mapreduce.TestMapReduceLazyOutput
Tests run: 1, Failures: 0, Errors: 0, Skipped: 0, Time elapsed: 149.239 sec - in org.apache.hadoop.mapreduce.TestMapReduceLazyOutput

Results :

Tests in error: 
  TestMRTimelineEventHandling.testMRTimelineEventHandling:99 » IO Job didn't fin...
  TestMRTimelineEventHandling.testMapreduceJobTimelineServiceEnabled:162 » IO Jo...

Tests run: 523, Failures: 0, Errors: 2, Skipped: 11

[INFO] ------------------------------------------------------------------------
[INFO] Reactor Summary:
[INFO] 
[INFO] Apache Hadoop MapReduce Client .................... SUCCESS [  3.481 s]
[INFO] Apache Hadoop MapReduce Core ...................... SUCCESS [01:56 min]
[INFO] Apache Hadoop MapReduce Common .................... SUCCESS [ 32.856 s]
[INFO] Apache Hadoop MapReduce Shuffle ................... SUCCESS [  7.107 s]
[INFO] Apache Hadoop MapReduce App ....................... SUCCESS [10:01 min]
[INFO] Apache Hadoop MapReduce HistoryServer ............. SUCCESS [05:59 min]
[INFO] Apache Hadoop MapReduce JobClient ................. FAILURE [  01:46 h]
[INFO] Apache Hadoop MapReduce HistoryServer Plugins ..... SKIPPED
[INFO] Apache Hadoop MapReduce NativeTask ................ SKIPPED
[INFO] Apache Hadoop MapReduce Examples .................. SKIPPED
[INFO] Apache Hadoop MapReduce ........................... SKIPPED
[INFO] ------------------------------------------------------------------------
[INFO] BUILD FAILURE
[INFO] ------------------------------------------------------------------------
[INFO] Total time: 02:05 h
[INFO] Finished at: 2015-11-08T23:09:35+00:00
[INFO] Final Memory: 37M/1058M
[INFO] ------------------------------------------------------------------------
[ERROR] Failed to execute goal org.apache.maven.plugins:maven-surefire-plugin:2.17:test (default-test)
on project hadoop-mapreduce-client-jobclient: There are test failures.
[ERROR] 
[ERROR] Please refer to /home/jenkins/jenkins-slave/workspace/Hadoop-Mapreduce-trunk/hadoop-mapreduce-project/hadoop-mapreduce-client/hadoop-mapreduce-client-jobclient/target/surefire-reports
for the individual test results.
[ERROR] -> [Help 1]
[ERROR] 
[ERROR] To see the full stack trace of the errors, re-run Maven with the -e switch.
[ERROR] Re-run Maven using the -X switch to enable full debug logging.
[ERROR] 
[ERROR] For more information about the errors and possible solutions, please read the following
articles:
[ERROR] [Help 1] http://cwiki.apache.org/confluence/display/MAVEN/MojoFailureException
[ERROR] 
[ERROR] After correcting the problems, you can resume the build with the command
[ERROR]   mvn <goals> -rf :hadoop-mapreduce-client-jobclient
Build step 'Execute shell' marked build as failure
[FINDBUGS] Skipping publisher since build result is FAILURE
Archiving artifacts
Recording test results
Updating HADOOP-11684
Email was triggered for: Failure - Any
Sending email for trigger: Failure - Any



###################################################################################
############################## FAILED TESTS (if any) ##############################
2 tests failed.
FAILED:  org.apache.hadoop.mapred.TestMRTimelineEventHandling.testMRTimelineEventHandling

Error Message:
Job didn't finish in 30 seconds

Stack Trace:
java.io.IOException: Job didn't finish in 30 seconds
	at org.apache.hadoop.mapred.UtilsForTests.runJobSucceed(UtilsForTests.java:622)
	at org.apache.hadoop.mapred.TestMRTimelineEventHandling.testMRTimelineEventHandling(TestMRTimelineEventHandling.java:99)


FAILED:  org.apache.hadoop.mapred.TestMRTimelineEventHandling.testMapreduceJobTimelineServiceEnabled

Error Message:
Job didn't finish in 30 seconds

Stack Trace:
java.io.IOException: Job didn't finish in 30 seconds
	at org.apache.hadoop.mapred.UtilsForTests.runJobSucceed(UtilsForTests.java:622)
	at org.apache.hadoop.mapred.TestMRTimelineEventHandling.testMapreduceJobTimelineServiceEnabled(TestMRTimelineEventHandling.java:162)



Mime
  • Unnamed multipart/mixed (inline, None, 0 bytes)
View raw message