hadoop-mapreduce-dev mailing list archives

Site index · List index
Message view « Date » · « Thread »
Top « Date » · « Thread »
From Apache Jenkins Server <jenk...@builds.apache.org>
Subject Hadoop-Mapreduce-trunk - Build # 2604 - Still Failing
Date Fri, 13 Nov 2015 02:02:01 GMT
See https://builds.apache.org/job/Hadoop-Mapreduce-trunk/2604/

###################################################################################
########################## LAST 60 LINES OF THE CONSOLE ###########################
[...truncated 35531 lines...]
Running org.apache.hadoop.mapred.TestReporter
Tests run: 3, Failures: 0, Errors: 0, Skipped: 0, Time elapsed: 14.467 sec - in org.apache.hadoop.mapred.TestReporter
Running org.apache.hadoop.mapred.TestClientRedirect
Tests run: 1, Failures: 0, Errors: 0, Skipped: 0, Time elapsed: 16.713 sec - in org.apache.hadoop.mapred.TestClientRedirect
Running org.apache.hadoop.mapred.TestReduceFetchFromPartialMem
Tests run: 1, Failures: 0, Errors: 0, Skipped: 0, Time elapsed: 90.073 sec - in org.apache.hadoop.mapred.TestReduceFetchFromPartialMem
Running org.apache.hadoop.mapred.TestSpecialCharactersInOutputPath
Tests run: 1, Failures: 0, Errors: 0, Skipped: 0, Time elapsed: 31.056 sec - in org.apache.hadoop.mapred.TestSpecialCharactersInOutputPath
Running org.apache.hadoop.mapred.TestSequenceFileAsBinaryOutputFormat
Tests run: 3, Failures: 0, Errors: 0, Skipped: 0, Time elapsed: 2.623 sec - in org.apache.hadoop.mapred.TestSequenceFileAsBinaryOutputFormat

Results :

Tests in error: 
  TestMRJobsWithProfiler.testDifferentProfilers:117->testProfilerInternal:155 ยป 

Tests run: 523, Failures: 0, Errors: 1, Skipped: 11

[INFO] ------------------------------------------------------------------------
[INFO] Reactor Summary:
[INFO] 
[INFO] Apache Hadoop MapReduce Client .................... SUCCESS [  3.943 s]
[INFO] Apache Hadoop MapReduce Core ...................... SUCCESS [02:22 min]
[INFO] Apache Hadoop MapReduce Common .................... SUCCESS [ 37.182 s]
[INFO] Apache Hadoop MapReduce Shuffle ................... SUCCESS [  7.279 s]
[INFO] Apache Hadoop MapReduce App ....................... SUCCESS [11:10 min]
[INFO] Apache Hadoop MapReduce HistoryServer ............. SUCCESS [06:31 min]
[INFO] Apache Hadoop MapReduce JobClient ................. FAILURE [  02:09 h]
[INFO] Apache Hadoop MapReduce HistoryServer Plugins ..... SKIPPED
[INFO] Apache Hadoop MapReduce NativeTask ................ SKIPPED
[INFO] Apache Hadoop MapReduce Examples .................. SKIPPED
[INFO] Apache Hadoop MapReduce ........................... SKIPPED
[INFO] ------------------------------------------------------------------------
[INFO] BUILD FAILURE
[INFO] ------------------------------------------------------------------------
[INFO] Total time: 02:30 h
[INFO] Finished at: 2015-11-13T02:01:49+00:00
[INFO] Final Memory: 37M/1174M
[INFO] ------------------------------------------------------------------------
[ERROR] Failed to execute goal org.apache.maven.plugins:maven-surefire-plugin:2.17:test (default-test)
on project hadoop-mapreduce-client-jobclient: There are test failures.
[ERROR] 
[ERROR] Please refer to /home/jenkins/jenkins-slave/workspace/Hadoop-Mapreduce-trunk/hadoop-mapreduce-project/hadoop-mapreduce-client/hadoop-mapreduce-client-jobclient/target/surefire-reports
for the individual test results.
[ERROR] -> [Help 1]
[ERROR] 
[ERROR] To see the full stack trace of the errors, re-run Maven with the -e switch.
[ERROR] Re-run Maven using the -X switch to enable full debug logging.
[ERROR] 
[ERROR] For more information about the errors and possible solutions, please read the following
articles:
[ERROR] [Help 1] http://cwiki.apache.org/confluence/display/MAVEN/MojoFailureException
[ERROR] 
[ERROR] After correcting the problems, you can resume the build with the command
[ERROR]   mvn <goals> -rf :hadoop-mapreduce-client-jobclient
Build step 'Execute shell' marked build as failure
[FINDBUGS] Skipping publisher since build result is FAILURE
Archiving artifacts
Recording test results
Updating YARN-1509
Email was triggered for: Failure - Any
Sending email for trigger: Failure - Any



###################################################################################
############################## FAILED TESTS (if any) ##############################
1 tests failed.
FAILED:  org.apache.hadoop.mapreduce.v2.TestMRJobsWithProfiler.testDifferentProfilers

Error Message:
test timed out after 150000 milliseconds

Stack Trace:
java.lang.Exception: test timed out after 150000 milliseconds
	at java.lang.Thread.sleep(Native Method)
	at org.apache.hadoop.mapreduce.v2.TestMRJobsWithProfiler.testProfilerInternal(TestMRJobsWithProfiler.java:155)
	at org.apache.hadoop.mapreduce.v2.TestMRJobsWithProfiler.testDifferentProfilers(TestMRJobsWithProfiler.java:117)



Mime
  • Unnamed multipart/mixed (inline, None, 0 bytes)
View raw message