hadoop-mapreduce-dev mailing list archives

Site index · List index
Message view « Date » · « Thread »
Top « Date » · « Thread »
From Apache Jenkins Server <jenk...@builds.apache.org>
Subject Hadoop-Mapreduce-trunk-Java8 - Build # 641 - Still Failing
Date Sat, 07 Nov 2015 19:30:05 GMT
See https://builds.apache.org/job/Hadoop-Mapreduce-trunk-Java8/641/

###################################################################################
########################## LAST 60 LINES OF THE CONSOLE ###########################
[...truncated 13602 lines...]
Java HotSpot(TM) 64-Bit Server VM warning: ignoring option MaxPermSize=768m; support was removed
in 8.0
Running org.apache.hadoop.util.TestMRCJCReflectionUtils
Tests run: 1, Failures: 0, Errors: 0, Skipped: 0, Time elapsed: 0.515 sec - in org.apache.hadoop.util.TestMRCJCReflectionUtils
Java HotSpot(TM) 64-Bit Server VM warning: ignoring option MaxPermSize=768m; support was removed
in 8.0
Running org.apache.hadoop.util.TestMRCJCRunJar
Tests run: 1, Failures: 0, Errors: 0, Skipped: 0, Time elapsed: 0.364 sec - in org.apache.hadoop.util.TestMRCJCRunJar

Results :

Tests in error: 
  TestMRTimelineEventHandling.testMRTimelineEventHandling:100 » IO Job didn't fi...
  TestMRTimelineEventHandling.testMapreduceJobTimelineServiceEnabled:162 » IO Jo...
  TestMRJobsWithProfiler.testDifferentProfilers:117->testProfilerInternal:150 » 
  TestMRJobsWithProfiler.tearDown:104 » NoClassDefFound org/apache/hadoop/servic...

Tests run: 524, Failures: 0, Errors: 4, Skipped: 11

[INFO] ------------------------------------------------------------------------
[INFO] Reactor Summary:
[INFO] 
[INFO] Apache Hadoop MapReduce Client .................... SUCCESS [  2.337 s]
[INFO] Apache Hadoop MapReduce Core ...................... SUCCESS [01:27 min]
[INFO] Apache Hadoop MapReduce Common .................... SUCCESS [ 26.502 s]
[INFO] Apache Hadoop MapReduce Shuffle ................... SUCCESS [  5.080 s]
[INFO] Apache Hadoop MapReduce App ....................... SUCCESS [10:54 min]
[INFO] Apache Hadoop MapReduce HistoryServer ............. SUCCESS [06:09 min]
[INFO] Apache Hadoop MapReduce JobClient ................. FAILURE [  01:44 h]
[INFO] Apache Hadoop MapReduce HistoryServer Plugins ..... SKIPPED
[INFO] Apache Hadoop MapReduce NativeTask ................ SKIPPED
[INFO] Apache Hadoop MapReduce Examples .................. SKIPPED
[INFO] Apache Hadoop MapReduce ........................... SKIPPED
[INFO] ------------------------------------------------------------------------
[INFO] BUILD FAILURE
[INFO] ------------------------------------------------------------------------
[INFO] Total time: 02:03 h
[INFO] Finished at: 2015-11-07T19:30:01+00:00
[INFO] Final Memory: 34M/237M
[INFO] ------------------------------------------------------------------------
[ERROR] Failed to execute goal org.apache.maven.plugins:maven-surefire-plugin:2.17:test (default-test)
on project hadoop-mapreduce-client-jobclient: There are test failures.
[ERROR] 
[ERROR] Please refer to /home/jenkins/jenkins-slave/workspace/Hadoop-Mapreduce-trunk-Java8/hadoop-mapreduce-project/hadoop-mapreduce-client/hadoop-mapreduce-client-jobclient/target/surefire-reports
for the individual test results.
[ERROR] -> [Help 1]
[ERROR] 
[ERROR] To see the full stack trace of the errors, re-run Maven with the -e switch.
[ERROR] Re-run Maven using the -X switch to enable full debug logging.
[ERROR] 
[ERROR] For more information about the errors and possible solutions, please read the following
articles:
[ERROR] [Help 1] http://cwiki.apache.org/confluence/display/MAVEN/MojoFailureException
[ERROR] 
[ERROR] After correcting the problems, you can resume the build with the command
[ERROR]   mvn <goals> -rf :hadoop-mapreduce-client-jobclient
Build step 'Execute shell' marked build as failure
[FINDBUGS] Skipping publisher since build result is FAILURE
Archiving artifacts
Recording test results
Updating HDFS-9394
Updating HADOOP-12366
Email was triggered for: Failure - Any
Sending email for trigger: Failure - Any



###################################################################################
############################## FAILED TESTS (if any) ##############################
4 tests failed.
FAILED:  org.apache.hadoop.mapred.TestMRTimelineEventHandling.testMRTimelineEventHandling

Error Message:
Job didn't finish in 30 seconds

Stack Trace:
java.io.IOException: Job didn't finish in 30 seconds
	at org.apache.hadoop.mapred.UtilsForTests.runJobSucceed(UtilsForTests.java:622)
	at org.apache.hadoop.mapred.TestMRTimelineEventHandling.testMRTimelineEventHandling(TestMRTimelineEventHandling.java:100)


FAILED:  org.apache.hadoop.mapred.TestMRTimelineEventHandling.testMapreduceJobTimelineServiceEnabled

Error Message:
Job didn't finish in 30 seconds

Stack Trace:
java.io.IOException: Job didn't finish in 30 seconds
	at org.apache.hadoop.mapred.UtilsForTests.runJobSucceed(UtilsForTests.java:622)
	at org.apache.hadoop.mapred.TestMRTimelineEventHandling.testMapreduceJobTimelineServiceEnabled(TestMRTimelineEventHandling.java:162)


FAILED:  org.apache.hadoop.mapreduce.v2.TestMRJobsWithProfiler.testDifferentProfilers

Error Message:
test timed out after 150000 milliseconds

Stack Trace:
java.lang.Exception: test timed out after 150000 milliseconds
	at java.lang.Thread.sleep(Native Method)
	at org.apache.hadoop.mapreduce.Job.monitorAndPrintJob(Job.java:1353)
	at org.apache.hadoop.mapreduce.Job.waitForCompletion(Job.java:1311)
	at org.apache.hadoop.mapreduce.v2.TestMRJobsWithProfiler.testProfilerInternal(TestMRJobsWithProfiler.java:150)
	at org.apache.hadoop.mapreduce.v2.TestMRJobsWithProfiler.testDifferentProfilers(TestMRJobsWithProfiler.java:117)


FAILED:  org.apache.hadoop.mapreduce.v2.TestMRJobsWithProfiler.org.apache.hadoop.mapreduce.v2.TestMRJobsWithProfiler

Error Message:
org/apache/hadoop/service/ServiceOperations

Stack Trace:
java.lang.NoClassDefFoundError: org/apache/hadoop/service/ServiceOperations
	at java.net.URLClassLoader$1.run(URLClassLoader.java:372)
	at java.net.URLClassLoader$1.run(URLClassLoader.java:361)
	at java.security.AccessController.doPrivileged(Native Method)
	at java.net.URLClassLoader.findClass(URLClassLoader.java:360)
	at java.lang.ClassLoader.loadClass(ClassLoader.java:424)
	at sun.misc.Launcher$AppClassLoader.loadClass(Launcher.java:308)
	at java.lang.ClassLoader.loadClass(ClassLoader.java:357)
	at org.apache.hadoop.service.CompositeService.stop(CompositeService.java:157)
	at org.apache.hadoop.service.CompositeService.serviceStop(CompositeService.java:131)
	at org.apache.hadoop.service.AbstractService.stop(AbstractService.java:221)
	at org.apache.hadoop.mapreduce.v2.TestMRJobsWithProfiler.tearDown(TestMRJobsWithProfiler.java:104)



Mime
  • Unnamed multipart/mixed (inline, None, 0 bytes)
View raw message