hadoop-mapreduce-dev mailing list archives

Site index · List index
Message view « Date » · « Thread »
Top « Date » · « Thread »
From Apache Jenkins Server <jenk...@builds.apache.org>
Subject Hadoop-Mapreduce-trunk-Java8 - Build # 696 - Still Failing
Date Mon, 23 Nov 2015 00:34:48 GMT
See https://builds.apache.org/job/Hadoop-Mapreduce-trunk-Java8/696/

###################################################################################
########################## LAST 60 LINES OF THE CONSOLE ###########################
[...truncated 10088 lines...]
Tests run: 6, Failures: 0, Errors: 0, Skipped: 0, Time elapsed: 1.008 sec - in org.apache.hadoop.mapred.TestTaskAttemptListenerImpl
Java HotSpot(TM) 64-Bit Server VM warning: ignoring option MaxPermSize=768m; support was removed
in 8.0
Running org.apache.hadoop.mapred.TestLocalContainerLauncher
Tests run: 2, Failures: 0, Errors: 0, Skipped: 0, Time elapsed: 1.539 sec - in org.apache.hadoop.mapred.TestLocalContainerLauncher

Results :

Failed tests: 
  TestMRAppMaster.testMRAppMasterMidLock:174 null

Tests in error: 
  TestMRAppMaster.testMRAppMasterSuccessLock:254 ยป YarnRuntime java.io.FileNotFo...

Tests run: 337, Failures: 1, Errors: 1, Skipped: 0

[INFO] ------------------------------------------------------------------------
[INFO] Reactor Summary:
[INFO] 
[INFO] Apache Hadoop MapReduce Client .................... SUCCESS [  2.149 s]
[INFO] Apache Hadoop MapReduce Core ...................... SUCCESS [01:23 min]
[INFO] Apache Hadoop MapReduce Common .................... SUCCESS [ 25.684 s]
[INFO] Apache Hadoop MapReduce Shuffle ................... SUCCESS [  4.140 s]
[INFO] Apache Hadoop MapReduce App ....................... FAILURE [10:55 min]
[INFO] Apache Hadoop MapReduce HistoryServer ............. SKIPPED
[INFO] Apache Hadoop MapReduce JobClient ................. SKIPPED
[INFO] Apache Hadoop MapReduce HistoryServer Plugins ..... SKIPPED
[INFO] Apache Hadoop MapReduce NativeTask ................ SKIPPED
[INFO] Apache Hadoop MapReduce Examples .................. SKIPPED
[INFO] Apache Hadoop MapReduce ........................... SKIPPED
[INFO] ------------------------------------------------------------------------
[INFO] BUILD FAILURE
[INFO] ------------------------------------------------------------------------
[INFO] Total time: 12:51 min
[INFO] Finished at: 2015-11-23T00:34:39+00:00
[INFO] Final Memory: 40M/261M
[INFO] ------------------------------------------------------------------------
[ERROR] Failed to execute goal org.apache.maven.plugins:maven-surefire-plugin:2.17:test (default-test)
on project hadoop-mapreduce-client-app: ExecutionException: java.lang.RuntimeException: The
forked VM terminated without properly saying goodbye. VM crash or System.exit called?
[ERROR] Command was /bin/sh -c cd /home/jenkins/jenkins-slave/workspace/Hadoop-Mapreduce-trunk-Java8/hadoop-mapreduce-project/hadoop-mapreduce-client/hadoop-mapreduce-client-app
&& /home/jenkins/tools/java/jdk1.8.0/jre/bin/java -Xmx2048m -XX:MaxPermSize=768m -XX:+HeapDumpOnOutOfMemoryError
-jar /home/jenkins/jenkins-slave/workspace/Hadoop-Mapreduce-trunk-Java8/hadoop-mapreduce-project/hadoop-mapreduce-client/hadoop-mapreduce-client-app/target/surefire/surefirebooter4525431769385347656.jar
/home/jenkins/jenkins-slave/workspace/Hadoop-Mapreduce-trunk-Java8/hadoop-mapreduce-project/hadoop-mapreduce-client/hadoop-mapreduce-client-app/target/surefire/surefire1008402052119045504tmp
/home/jenkins/jenkins-slave/workspace/Hadoop-Mapreduce-trunk-Java8/hadoop-mapreduce-project/hadoop-mapreduce-client/hadoop-mapreduce-client-app/target/surefire/surefire_1047890559932587646722tmp
[ERROR] -> [Help 1]
[ERROR] 
[ERROR] To see the full stack trace of the errors, re-run Maven with the -e switch.
[ERROR] Re-run Maven using the -X switch to enable full debug logging.
[ERROR] 
[ERROR] For more information about the errors and possible solutions, please read the following
articles:
[ERROR] [Help 1] http://cwiki.apache.org/confluence/display/MAVEN/MojoFailureException
[ERROR] 
[ERROR] After correcting the problems, you can resume the build with the command
[ERROR]   mvn <goals> -rf :hadoop-mapreduce-client-app
Build step 'Execute shell' marked build as failure
[FINDBUGS] Skipping publisher since build result is FAILURE
Archiving artifacts
Recording test results
Updating HDFS-8914
Updating HDFS-9402
Updating HADOOP-12572
Updating HADOOP-12467
Updating HADOOP-11218
Email was triggered for: Failure - Any
Sending email for trigger: Failure - Any



###################################################################################
############################## FAILED TESTS (if any) ##############################
2 tests failed.
FAILED:  org.apache.hadoop.mapreduce.v2.app.TestMRAppMaster.testMRAppMasterSuccessLock

Error Message:
java.io.FileNotFoundException: File file:/home/jenkins/jenkins-slave/workspace/Hadoop-Mapreduce-trunk-Java8/hadoop-mapreduce-project/hadoop-mapreduce-client/hadoop-mapreduce-client-app/staging/history/done_intermediate/TestAppMasterUser/job_1317529182569_0004_conf.xml_tmp
does not exist

Stack Trace:
org.apache.hadoop.yarn.exceptions.YarnRuntimeException: java.io.FileNotFoundException: File
file:/home/jenkins/jenkins-slave/workspace/Hadoop-Mapreduce-trunk-Java8/hadoop-mapreduce-project/hadoop-mapreduce-client/hadoop-mapreduce-client-app/staging/history/done_intermediate/TestAppMasterUser/job_1317529182569_0004_conf.xml_tmp
does not exist
	at org.apache.hadoop.fs.RawLocalFileSystem.deprecatedGetFileStatus(RawLocalFileSystem.java:640)
	at org.apache.hadoop.fs.RawLocalFileSystem.getFileLinkStatusInternal(RawLocalFileSystem.java:866)
	at org.apache.hadoop.fs.RawLocalFileSystem.getFileStatus(RawLocalFileSystem.java:630)
	at org.apache.hadoop.fs.FileUtil.copy(FileUtil.java:340)
	at org.apache.hadoop.fs.FileUtil.copy(FileUtil.java:292)
	at org.apache.hadoop.fs.RawLocalFileSystem.rename(RawLocalFileSystem.java:372)
	at org.apache.hadoop.fs.ChecksumFileSystem.rename(ChecksumFileSystem.java:513)
	at org.apache.hadoop.mapreduce.jobhistory.JobHistoryEventHandler.moveTmpToDone(JobHistoryEventHandler.java:1346)
	at org.apache.hadoop.mapreduce.jobhistory.JobHistoryEventHandler.processDoneFiles(JobHistoryEventHandler.java:1153)
	at org.apache.hadoop.service.ServiceOperations.stop(ServiceOperations.java:52)
	at org.apache.hadoop.service.ServiceOperations.stopQuietly(ServiceOperations.java:80)
	at org.apache.hadoop.service.CompositeService.stop(CompositeService.java:157)
	at org.apache.hadoop.service.CompositeService.serviceStop(CompositeService.java:131)
	at org.apache.hadoop.mapreduce.v2.app.MRAppMaster.serviceStop(MRAppMaster.java:1751)
	at org.apache.hadoop.service.AbstractService.stop(AbstractService.java:221)
	at org.apache.hadoop.mapreduce.v2.app.MRAppMaster.stop(MRAppMaster.java:1247)
	at org.apache.hadoop.mapreduce.v2.app.TestMRAppMaster.testMRAppMasterSuccessLock(TestMRAppMaster.java:254)


FAILED:  org.apache.hadoop.mapreduce.v2.app.TestMRAppMaster.testMRAppMasterMidLock

Error Message:
null

Stack Trace:
java.lang.AssertionError: null
	at org.junit.Assert.fail(Assert.java:86)
	at org.junit.Assert.assertTrue(Assert.java:41)
	at org.junit.Assert.assertTrue(Assert.java:52)
	at org.apache.hadoop.mapreduce.v2.app.TestMRAppMaster.testMRAppMasterMidLock(TestMRAppMaster.java:174)



Mime
  • Unnamed multipart/mixed (inline, None, 0 bytes)
View raw message