hadoop-mapreduce-dev mailing list archives

Site index · List index
Message view « Date » · « Thread »
Top « Date » · « Thread »
From Apache Jenkins Server <jenk...@builds.apache.org>
Subject Hadoop-Mapreduce-trunk - Build # 2587 - Failure
Date Mon, 09 Nov 2015 20:59:48 GMT
See https://builds.apache.org/job/Hadoop-Mapreduce-trunk/2587/

###################################################################################
########################## LAST 60 LINES OF THE CONSOLE ###########################
[...truncated 32857 lines...]
Tests run: 11, Failures: 0, Errors: 0, Skipped: 0, Time elapsed: 14.013 sec - in org.apache.hadoop.mapreduce.TestMapCollection
Running org.apache.hadoop.conf.TestNoDefaultsJobConf
Tests run: 1, Failures: 0, Errors: 0, Skipped: 0, Time elapsed: 23.158 sec - in org.apache.hadoop.conf.TestNoDefaultsJobConf
Running org.apache.hadoop.util.TestMRCJCReflectionUtils
Tests run: 1, Failures: 0, Errors: 0, Skipped: 0, Time elapsed: 0.69 sec - in org.apache.hadoop.util.TestMRCJCReflectionUtils
Running org.apache.hadoop.util.TestMRCJCRunJar
Tests run: 1, Failures: 0, Errors: 0, Skipped: 0, Time elapsed: 0.271 sec - in org.apache.hadoop.util.TestMRCJCRunJar

Results :

Tests in error: 
  TestMRTimelineEventHandling.testMRTimelineEventHandling:99 » IO Job didn't fin...
  TestMRTimelineEventHandling.testMapreduceJobTimelineServiceEnabled:162 » IO Jo...
  TestClusterMapReduceTestCase.testDFSRestart:103->ClusterMapReduceTestCase.startCluster:81
» FileNotFound
  TestClusterMapReduceTestCase>ClusterMapReduceTestCase.setUp:56->ClusterMapReduceTestCase.startCluster:81
» FileNotFound

Tests run: 523, Failures: 0, Errors: 4, Skipped: 11

[INFO] ------------------------------------------------------------------------
[INFO] Reactor Summary:
[INFO] 
[INFO] Apache Hadoop MapReduce Client .................... SUCCESS [  2.756 s]
[INFO] Apache Hadoop MapReduce Core ...................... SUCCESS [01:39 min]
[INFO] Apache Hadoop MapReduce Common .................... SUCCESS [ 28.574 s]
[INFO] Apache Hadoop MapReduce Shuffle ................... SUCCESS [  5.909 s]
[INFO] Apache Hadoop MapReduce App ....................... SUCCESS [09:20 min]
[INFO] Apache Hadoop MapReduce HistoryServer ............. SUCCESS [05:51 min]
[INFO] Apache Hadoop MapReduce JobClient ................. FAILURE [  01:43 h]
[INFO] Apache Hadoop MapReduce HistoryServer Plugins ..... SKIPPED
[INFO] Apache Hadoop MapReduce NativeTask ................ SKIPPED
[INFO] Apache Hadoop MapReduce Examples .................. SKIPPED
[INFO] Apache Hadoop MapReduce ........................... SKIPPED
[INFO] ------------------------------------------------------------------------
[INFO] BUILD FAILURE
[INFO] ------------------------------------------------------------------------
[INFO] Total time: 02:00 h
[INFO] Finished at: 2015-11-09T20:59:47+00:00
[INFO] Final Memory: 34M/750M
[INFO] ------------------------------------------------------------------------
[ERROR] Failed to execute goal org.apache.maven.plugins:maven-surefire-plugin:2.17:test (default-test)
on project hadoop-mapreduce-client-jobclient: There are test failures.
[ERROR] 
[ERROR] Please refer to /home/jenkins/jenkins-slave/workspace/Hadoop-Mapreduce-trunk/hadoop-mapreduce-project/hadoop-mapreduce-client/hadoop-mapreduce-client-jobclient/target/surefire-reports
for the individual test results.
[ERROR] -> [Help 1]
[ERROR] 
[ERROR] To see the full stack trace of the errors, re-run Maven with the -e switch.
[ERROR] Re-run Maven using the -X switch to enable full debug logging.
[ERROR] 
[ERROR] For more information about the errors and possible solutions, please read the following
articles:
[ERROR] [Help 1] http://cwiki.apache.org/confluence/display/MAVEN/MojoFailureException
[ERROR] 
[ERROR] After correcting the problems, you can resume the build with the command
[ERROR]   mvn <goals> -rf :hadoop-mapreduce-client-jobclient
Build step 'Execute shell' marked build as failure
[FINDBUGS] Skipping publisher since build result is FAILURE
Archiving artifacts
Recording test results
Updating HDFS-9234
Email was triggered for: Failure - Any
Sending email for trigger: Failure - Any



###################################################################################
############################## FAILED TESTS (if any) ##############################
4 tests failed.
FAILED:  org.apache.hadoop.mapred.TestClusterMapReduceTestCase.testDFSRestart

Error Message:
webapps/hdfs not found in CLASSPATH

Stack Trace:
java.io.FileNotFoundException: webapps/hdfs not found in CLASSPATH
	at org.apache.hadoop.http.HttpServer2.getWebAppsPath(HttpServer2.java:758)
	at org.apache.hadoop.http.HttpServer2.<init>(HttpServer2.java:334)
	at org.apache.hadoop.http.HttpServer2.<init>(HttpServer2.java:114)
	at org.apache.hadoop.http.HttpServer2$Builder.build(HttpServer2.java:290)
	at org.apache.hadoop.hdfs.server.namenode.NameNodeHttpServer.start(NameNodeHttpServer.java:126)
	at org.apache.hadoop.hdfs.server.namenode.NameNode.startHttpServer(NameNode.java:821)
	at org.apache.hadoop.hdfs.server.namenode.NameNode.initialize(NameNode.java:675)
	at org.apache.hadoop.hdfs.server.namenode.NameNode.<init>(NameNode.java:883)
	at org.apache.hadoop.hdfs.server.namenode.NameNode.<init>(NameNode.java:862)
	at org.apache.hadoop.hdfs.server.namenode.NameNode.createNameNode(NameNode.java:1555)
	at org.apache.hadoop.hdfs.MiniDFSCluster.createNameNode(MiniDFSCluster.java:1247)
	at org.apache.hadoop.hdfs.MiniDFSCluster.configureNameService(MiniDFSCluster.java:1016)
	at org.apache.hadoop.hdfs.MiniDFSCluster.createNameNodesAndSetConf(MiniDFSCluster.java:891)
	at org.apache.hadoop.hdfs.MiniDFSCluster.initMiniDFSCluster(MiniDFSCluster.java:823)
	at org.apache.hadoop.hdfs.MiniDFSCluster.<init>(MiniDFSCluster.java:482)
	at org.apache.hadoop.hdfs.MiniDFSCluster$Builder.build(MiniDFSCluster.java:441)
	at org.apache.hadoop.mapred.ClusterMapReduceTestCase.startCluster(ClusterMapReduceTestCase.java:81)
	at org.apache.hadoop.mapred.TestClusterMapReduceTestCase.testDFSRestart(TestClusterMapReduceTestCase.java:103)


FAILED:  org.apache.hadoop.mapred.TestClusterMapReduceTestCase.testMapReduce

Error Message:
webapps/hdfs not found in CLASSPATH

Stack Trace:
java.io.FileNotFoundException: webapps/hdfs not found in CLASSPATH
	at org.apache.hadoop.http.HttpServer2.getWebAppsPath(HttpServer2.java:758)
	at org.apache.hadoop.http.HttpServer2.<init>(HttpServer2.java:334)
	at org.apache.hadoop.http.HttpServer2.<init>(HttpServer2.java:114)
	at org.apache.hadoop.http.HttpServer2$Builder.build(HttpServer2.java:290)
	at org.apache.hadoop.hdfs.server.namenode.NameNodeHttpServer.start(NameNodeHttpServer.java:126)
	at org.apache.hadoop.hdfs.server.namenode.NameNode.startHttpServer(NameNode.java:821)
	at org.apache.hadoop.hdfs.server.namenode.NameNode.initialize(NameNode.java:675)
	at org.apache.hadoop.hdfs.server.namenode.NameNode.<init>(NameNode.java:883)
	at org.apache.hadoop.hdfs.server.namenode.NameNode.<init>(NameNode.java:862)
	at org.apache.hadoop.hdfs.server.namenode.NameNode.createNameNode(NameNode.java:1555)
	at org.apache.hadoop.hdfs.MiniDFSCluster.createNameNode(MiniDFSCluster.java:1247)
	at org.apache.hadoop.hdfs.MiniDFSCluster.configureNameService(MiniDFSCluster.java:1016)
	at org.apache.hadoop.hdfs.MiniDFSCluster.createNameNodesAndSetConf(MiniDFSCluster.java:891)
	at org.apache.hadoop.hdfs.MiniDFSCluster.initMiniDFSCluster(MiniDFSCluster.java:823)
	at org.apache.hadoop.hdfs.MiniDFSCluster.<init>(MiniDFSCluster.java:482)
	at org.apache.hadoop.hdfs.MiniDFSCluster$Builder.build(MiniDFSCluster.java:441)
	at org.apache.hadoop.mapred.ClusterMapReduceTestCase.startCluster(ClusterMapReduceTestCase.java:81)
	at org.apache.hadoop.mapred.ClusterMapReduceTestCase.setUp(ClusterMapReduceTestCase.java:56)
	at junit.framework.TestCase.runBare(TestCase.java:139)
	at junit.framework.TestResult$1.protect(TestResult.java:122)
	at junit.framework.TestResult.runProtected(TestResult.java:142)
	at junit.framework.TestResult.run(TestResult.java:125)
	at junit.framework.TestCase.run(TestCase.java:129)
	at junit.framework.TestSuite.runTest(TestSuite.java:255)
	at junit.framework.TestSuite.run(TestSuite.java:250)
	at org.junit.internal.runners.JUnit38ClassRunner.run(JUnit38ClassRunner.java:84)
	at org.apache.maven.surefire.junit4.JUnit4Provider.execute(JUnit4Provider.java:264)
	at org.apache.maven.surefire.junit4.JUnit4Provider.executeTestSet(JUnit4Provider.java:153)
	at org.apache.maven.surefire.junit4.JUnit4Provider.invoke(JUnit4Provider.java:124)
	at org.apache.maven.surefire.booter.ForkedBooter.invokeProviderInSameClassLoader(ForkedBooter.java:200)
	at org.apache.maven.surefire.booter.ForkedBooter.runSuitesInProcess(ForkedBooter.java:153)
	at org.apache.maven.surefire.booter.ForkedBooter.main(ForkedBooter.java:103)


FAILED:  org.apache.hadoop.mapred.TestMRTimelineEventHandling.testMRTimelineEventHandling

Error Message:
Job didn't finish in 30 seconds

Stack Trace:
java.io.IOException: Job didn't finish in 30 seconds
	at org.apache.hadoop.mapred.UtilsForTests.runJobSucceed(UtilsForTests.java:622)
	at org.apache.hadoop.mapred.TestMRTimelineEventHandling.testMRTimelineEventHandling(TestMRTimelineEventHandling.java:99)


FAILED:  org.apache.hadoop.mapred.TestMRTimelineEventHandling.testMapreduceJobTimelineServiceEnabled

Error Message:
Job didn't finish in 30 seconds

Stack Trace:
java.io.IOException: Job didn't finish in 30 seconds
	at org.apache.hadoop.mapred.UtilsForTests.runJobSucceed(UtilsForTests.java:622)
	at org.apache.hadoop.mapred.TestMRTimelineEventHandling.testMapreduceJobTimelineServiceEnabled(TestMRTimelineEventHandling.java:162)



Mime
  • Unnamed multipart/mixed (inline, None, 0 bytes)
View raw message