hadoop-mapreduce-dev mailing list archives

Site index · List index
Message view « Date » · « Thread »
Top « Date » · « Thread »
From Apache Jenkins Server <jenk...@builds.apache.org>
Subject Hadoop-Mapreduce-trunk-Java8 - Build # 663 - Failure
Date Thu, 12 Nov 2015 22:43:00 GMT
See https://builds.apache.org/job/Hadoop-Mapreduce-trunk-Java8/663/

###################################################################################
########################## LAST 60 LINES OF THE CONSOLE ###########################
[...truncated 10217 lines...]
Java HotSpot(TM) 64-Bit Server VM warning: ignoring option MaxPermSize=768m; support was removed
in 8.0
Running org.apache.hadoop.mapreduce.v2.hs.webapp.TestBlocks
Tests run: 5, Failures: 0, Errors: 0, Skipped: 0, Time elapsed: 2.928 sec - in org.apache.hadoop.mapreduce.v2.hs.webapp.TestBlocks
Java HotSpot(TM) 64-Bit Server VM warning: ignoring option MaxPermSize=768m; support was removed
in 8.0
Running org.apache.hadoop.mapreduce.v2.hs.webapp.TestHSWebApp
Tests run: 15, Failures: 0, Errors: 0, Skipped: 0, Time elapsed: 17.355 sec - in org.apache.hadoop.mapreduce.v2.hs.webapp.TestHSWebApp
Java HotSpot(TM) 64-Bit Server VM warning: ignoring option MaxPermSize=768m; support was removed
in 8.0
Running org.apache.hadoop.mapreduce.v2.hs.TestCompletedTask
Tests run: 2, Failures: 0, Errors: 0, Skipped: 0, Time elapsed: 1.595 sec - in org.apache.hadoop.mapreduce.v2.hs.TestCompletedTask

Results :

Tests in error: 
  TestJobListCache.testAddExisting:39 ยป  test timed out after 1000 milliseconds

Tests run: 198, Failures: 0, Errors: 1, Skipped: 0

[INFO] ------------------------------------------------------------------------
[INFO] Reactor Summary:
[INFO] 
[INFO] Apache Hadoop MapReduce Client .................... SUCCESS [  4.597 s]
[INFO] Apache Hadoop MapReduce Core ...................... SUCCESS [02:56 min]
[INFO] Apache Hadoop MapReduce Common .................... SUCCESS [ 53.199 s]
[INFO] Apache Hadoop MapReduce Shuffle ................... SUCCESS [  8.956 s]
[INFO] Apache Hadoop MapReduce App ....................... SUCCESS [15:22 min]
[INFO] Apache Hadoop MapReduce HistoryServer ............. FAILURE [08:21 min]
[INFO] Apache Hadoop MapReduce JobClient ................. SKIPPED
[INFO] Apache Hadoop MapReduce HistoryServer Plugins ..... SKIPPED
[INFO] Apache Hadoop MapReduce NativeTask ................ SKIPPED
[INFO] Apache Hadoop MapReduce Examples .................. SKIPPED
[INFO] Apache Hadoop MapReduce ........................... SKIPPED
[INFO] ------------------------------------------------------------------------
[INFO] BUILD FAILURE
[INFO] ------------------------------------------------------------------------
[INFO] Total time: 27:48 min
[INFO] Finished at: 2015-11-12T22:42:48+00:00
[INFO] Final Memory: 45M/300M
[INFO] ------------------------------------------------------------------------
[ERROR] Failed to execute goal org.apache.maven.plugins:maven-surefire-plugin:2.17:test (default-test)
on project hadoop-mapreduce-client-hs: There are test failures.
[ERROR] 
[ERROR] Please refer to /home/jenkins/jenkins-slave/workspace/Hadoop-Mapreduce-trunk-Java8/hadoop-mapreduce-project/hadoop-mapreduce-client/hadoop-mapreduce-client-hs/target/surefire-reports
for the individual test results.
[ERROR] -> [Help 1]
[ERROR] 
[ERROR] To see the full stack trace of the errors, re-run Maven with the -e switch.
[ERROR] Re-run Maven using the -X switch to enable full debug logging.
[ERROR] 
[ERROR] For more information about the errors and possible solutions, please read the following
articles:
[ERROR] [Help 1] http://cwiki.apache.org/confluence/display/MAVEN/MojoFailureException
[ERROR] 
[ERROR] After correcting the problems, you can resume the build with the command
[ERROR]   mvn <goals> -rf :hadoop-mapreduce-client-hs
Build step 'Execute shell' marked build as failure
[FINDBUGS] Skipping publisher since build result is FAILURE
Archiving artifacts
Recording test results
Updating HDFS-8968
Updating YARN-1509
Email was triggered for: Failure - Any
Sending email for trigger: Failure - Any



###################################################################################
############################## FAILED TESTS (if any) ##############################
1 tests failed.
FAILED:  org.apache.hadoop.mapreduce.v2.hs.TestJobListCache.testAddExisting

Error Message:
test timed out after 1000 milliseconds

Stack Trace:
java.lang.Exception: test timed out after 1000 milliseconds
	at org.mockito.asm.Item.set(Item.java:213)
	at org.mockito.asm.ClassWriter.newMethodItem(ClassWriter.java:1020)
	at org.mockito.asm.MethodWriter.visitMethodInsn(MethodWriter.java:808)
	at org.mockito.cglib.core.CodeEmitter.emit_invoke(CodeEmitter.java:501)
	at org.mockito.cglib.core.CodeEmitter.invoke_virtual(CodeEmitter.java:512)
	at org.mockito.cglib.core.EmitUtils.append_string_helper(EmitUtils.java:630)
	at org.mockito.cglib.core.EmitUtils.append_string(EmitUtils.java:576)
	at org.mockito.cglib.core.KeyFactory$Generator.generateClass(KeyFactory.java:248)
	at org.mockito.cglib.core.DefaultGeneratorStrategy.generate(DefaultGeneratorStrategy.java:25)
	at org.mockito.cglib.core.AbstractClassGenerator.create(AbstractClassGenerator.java:217)
	at org.mockito.cglib.core.KeyFactory$Generator.create(KeyFactory.java:145)
	at org.mockito.cglib.core.KeyFactory.create(KeyFactory.java:117)
	at org.mockito.cglib.core.KeyFactory.create(KeyFactory.java:109)
	at org.mockito.cglib.core.KeyFactory.create(KeyFactory.java:105)
	at org.mockito.cglib.core.MethodWrapper.<clinit>(MethodWrapper.java:22)
	at org.mockito.cglib.proxy.Enhancer.getMethods(Enhancer.java:433)
	at org.mockito.cglib.proxy.Enhancer.generateClass(Enhancer.java:457)
	at org.mockito.cglib.core.DefaultGeneratorStrategy.generate(DefaultGeneratorStrategy.java:25)
	at org.mockito.cglib.core.AbstractClassGenerator.create(AbstractClassGenerator.java:217)
	at org.mockito.cglib.proxy.Enhancer.createHelper(Enhancer.java:378)
	at org.mockito.cglib.proxy.Enhancer.createClass(Enhancer.java:318)
	at org.mockito.internal.creation.jmock.ClassImposterizer.createProxyClass(ClassImposterizer.java:93)
	at org.mockito.internal.creation.jmock.ClassImposterizer.imposterise(ClassImposterizer.java:50)
	at org.mockito.internal.util.MockUtil.createMock(MockUtil.java:54)
	at org.mockito.internal.MockitoCore.mock(MockitoCore.java:45)
	at org.mockito.Mockito.mock(Mockito.java:921)
	at org.mockito.Mockito.mock(Mockito.java:816)
	at org.apache.hadoop.mapreduce.v2.hs.TestJobListCache.testAddExisting(TestJobListCache.java:39)



Mime
  • Unnamed multipart/mixed (inline, None, 0 bytes)
View raw message