hadoop-mapreduce-dev mailing list archives

Site index · List index
Message view « Date » · « Thread »
Top « Date » · « Thread »
From Apache Jenkins Server <jenk...@builds.apache.org>
Subject Hadoop-Mapreduce-trunk - Build # 2602 - Still Failing
Date Thu, 12 Nov 2015 19:10:37 GMT
See https://builds.apache.org/job/Hadoop-Mapreduce-trunk/2602/

###################################################################################
########################## LAST 60 LINES OF THE CONSOLE ###########################
[...truncated 32340 lines...]
Running org.apache.hadoop.mapreduce.v2.app.TestMRApp
Tests run: 13, Failures: 0, Errors: 0, Skipped: 0, Time elapsed: 21.93 sec - in org.apache.hadoop.mapreduce.v2.app.TestMRApp
Running org.apache.hadoop.mapred.TestTaskAttemptFinishingMonitor
Tests run: 1, Failures: 0, Errors: 0, Skipped: 0, Time elapsed: 1.583 sec - in org.apache.hadoop.mapred.TestTaskAttemptFinishingMonitor
Running org.apache.hadoop.mapred.TestTaskAttemptListenerImpl
Tests run: 6, Failures: 0, Errors: 0, Skipped: 0, Time elapsed: 1.346 sec - in org.apache.hadoop.mapred.TestTaskAttemptListenerImpl
Running org.apache.hadoop.mapred.TestLocalContainerLauncher
Tests run: 2, Failures: 0, Errors: 0, Skipped: 0, Time elapsed: 1.889 sec - in org.apache.hadoop.mapred.TestLocalContainerLauncher

Results :

Tests in error: 
  TestJobEndNotifier.testNotificationOnLastRetryNormalShutdown:202->startHttpServer:286
NoClassDefFound
  TestJobEndNotifier.testAbsentNotificationOnNotLastRetryUnregistrationFailure:226->startHttpServer:286
NoClassDefFound
  TestJobEndNotifier.testNotificationOnLastRetryUnregistrationFailure:253->startHttpServer:286
NoClassDefFound
  TestRMContainerAllocator.testHeartbeatHandler:2289 ยป NoClassDefFound org/apach...

Tests run: 314, Failures: 0, Errors: 3, Skipped: 0

[INFO] ------------------------------------------------------------------------
[INFO] Reactor Summary:
[INFO] 
[INFO] Apache Hadoop MapReduce Client .................... SUCCESS [  3.940 s]
[INFO] Apache Hadoop MapReduce Core ...................... SUCCESS [01:40 min]
[INFO] Apache Hadoop MapReduce Common .................... SUCCESS [ 28.868 s]
[INFO] Apache Hadoop MapReduce Shuffle ................... SUCCESS [  4.962 s]
[INFO] Apache Hadoop MapReduce App ....................... FAILURE [08:52 min]
[INFO] Apache Hadoop MapReduce HistoryServer ............. SKIPPED
[INFO] Apache Hadoop MapReduce JobClient ................. SKIPPED
[INFO] Apache Hadoop MapReduce HistoryServer Plugins ..... SKIPPED
[INFO] Apache Hadoop MapReduce NativeTask ................ SKIPPED
[INFO] Apache Hadoop MapReduce Examples .................. SKIPPED
[INFO] Apache Hadoop MapReduce ........................... SKIPPED
[INFO] ------------------------------------------------------------------------
[INFO] BUILD FAILURE
[INFO] ------------------------------------------------------------------------
[INFO] Total time: 11:12 min
[INFO] Finished at: 2015-11-12T19:10:30+00:00
[INFO] Final Memory: 41M/825M
[INFO] ------------------------------------------------------------------------
[ERROR] Failed to execute goal org.apache.maven.plugins:maven-surefire-plugin:2.17:test (default-test)
on project hadoop-mapreduce-client-app: ExecutionException: java.lang.RuntimeException: The
forked VM terminated without properly saying goodbye. VM crash or System.exit called?
[ERROR] Command was /bin/sh -c cd /home/jenkins/jenkins-slave/workspace/Hadoop-Mapreduce-trunk/hadoop-mapreduce-project/hadoop-mapreduce-client/hadoop-mapreduce-client-app
&& /home/jenkins/tools/java/jdk1.7.0_55/jre/bin/java -Xmx2048m -XX:MaxPermSize=768m
-XX:+HeapDumpOnOutOfMemoryError -jar /home/jenkins/jenkins-slave/workspace/Hadoop-Mapreduce-trunk/hadoop-mapreduce-project/hadoop-mapreduce-client/hadoop-mapreduce-client-app/target/surefire/surefirebooter2186156745142312019.jar
/home/jenkins/jenkins-slave/workspace/Hadoop-Mapreduce-trunk/hadoop-mapreduce-project/hadoop-mapreduce-client/hadoop-mapreduce-client-app/target/surefire/surefire5572211717518329587tmp
/home/jenkins/jenkins-slave/workspace/Hadoop-Mapreduce-trunk/hadoop-mapreduce-project/hadoop-mapreduce-client/hadoop-mapreduce-client-app/target/surefire/surefire_915238474444519607689tmp
[ERROR] -> [Help 1]
[ERROR] 
[ERROR] To see the full stack trace of the errors, re-run Maven with the -e switch.
[ERROR] Re-run Maven using the -X switch to enable full debug logging.
[ERROR] 
[ERROR] For more information about the errors and possible solutions, please read the following
articles:
[ERROR] [Help 1] http://cwiki.apache.org/confluence/display/MAVEN/MojoFailureException
[ERROR] 
[ERROR] After correcting the problems, you can resume the build with the command
[ERROR]   mvn <goals> -rf :hadoop-mapreduce-client-app
Build step 'Execute shell' marked build as failure
[FINDBUGS] Skipping publisher since build result is FAILURE
Archiving artifacts
Recording test results
Updating HADOOP-12562
Email was triggered for: Failure - Any
Sending email for trigger: Failure - Any



###################################################################################
############################## FAILED TESTS (if any) ##############################
3 tests failed.
FAILED:  org.apache.hadoop.mapreduce.v2.app.TestJobEndNotifier.testNotificationOnLastRetryNormalShutdown

Error Message:
org/apache/hadoop/http/HttpServer2$Builder

Stack Trace:
java.lang.NoClassDefFoundError: org/apache/hadoop/http/HttpServer2$Builder
	at java.net.URLClassLoader$1.run(URLClassLoader.java:366)
	at java.net.URLClassLoader$1.run(URLClassLoader.java:355)
	at java.security.AccessController.doPrivileged(Native Method)
	at java.net.URLClassLoader.findClass(URLClassLoader.java:354)
	at java.lang.ClassLoader.loadClass(ClassLoader.java:425)
	at sun.misc.Launcher$AppClassLoader.loadClass(Launcher.java:308)
	at java.lang.ClassLoader.loadClass(ClassLoader.java:358)
	at org.apache.hadoop.mapreduce.v2.app.TestJobEndNotifier.startHttpServer(TestJobEndNotifier.java:286)
	at org.apache.hadoop.mapreduce.v2.app.TestJobEndNotifier.testNotificationOnLastRetryNormalShutdown(TestJobEndNotifier.java:202)


FAILED:  org.apache.hadoop.mapreduce.v2.app.TestJobEndNotifier.testAbsentNotificationOnNotLastRetryUnregistrationFailure

Error Message:
org/apache/hadoop/http/HttpServer2$Builder

Stack Trace:
java.lang.NoClassDefFoundError: org/apache/hadoop/http/HttpServer2$Builder
	at org.apache.hadoop.mapreduce.v2.app.TestJobEndNotifier.startHttpServer(TestJobEndNotifier.java:286)
	at org.apache.hadoop.mapreduce.v2.app.TestJobEndNotifier.testAbsentNotificationOnNotLastRetryUnregistrationFailure(TestJobEndNotifier.java:226)


FAILED:  org.apache.hadoop.mapreduce.v2.app.TestJobEndNotifier.testNotificationOnLastRetryUnregistrationFailure

Error Message:
org/apache/hadoop/http/HttpServer2$Builder

Stack Trace:
java.lang.NoClassDefFoundError: org/apache/hadoop/http/HttpServer2$Builder
	at org.apache.hadoop.mapreduce.v2.app.TestJobEndNotifier.startHttpServer(TestJobEndNotifier.java:286)
	at org.apache.hadoop.mapreduce.v2.app.TestJobEndNotifier.testNotificationOnLastRetryUnregistrationFailure(TestJobEndNotifier.java:253)



Mime
  • Unnamed multipart/mixed (inline, None, 0 bytes)
View raw message