hadoop-mapreduce-dev mailing list archives

Site index · List index
Message view « Date » · « Thread »
Top « Date » · « Thread »
From Apache Jenkins Server <jenk...@builds.apache.org>
Subject Hadoop-Mapreduce-trunk - Build # 2556 - Still Failing
Date Mon, 02 Nov 2015 07:10:45 GMT
See https://builds.apache.org/job/Hadoop-Mapreduce-trunk/2556/

###################################################################################
########################## LAST 60 LINES OF THE CONSOLE ###########################
[...truncated 35554 lines...]
Running org.apache.hadoop.mapred.TestClientRedirect
Tests run: 1, Failures: 0, Errors: 0, Skipped: 0, Time elapsed: 17.15 sec - in org.apache.hadoop.mapred.TestClientRedirect
Running org.apache.hadoop.mapred.TestReduceFetchFromPartialMem
Tests run: 1, Failures: 0, Errors: 0, Skipped: 0, Time elapsed: 95.487 sec - in org.apache.hadoop.mapred.TestReduceFetchFromPartialMem
Running org.apache.hadoop.mapred.TestSpecialCharactersInOutputPath
Tests run: 1, Failures: 0, Errors: 0, Skipped: 0, Time elapsed: 31.915 sec - in org.apache.hadoop.mapred.TestSpecialCharactersInOutputPath
Running org.apache.hadoop.mapred.TestSequenceFileAsBinaryOutputFormat
Tests run: 3, Failures: 0, Errors: 0, Skipped: 0, Time elapsed: 2.942 sec - in org.apache.hadoop.mapred.TestSequenceFileAsBinaryOutputFormat

Results :

Tests in error: 
  TestMRJobsWithProfiler.testDifferentProfilers:117->testProfilerInternal:150 » 
  TestMRTimelineEventHandling.testMRTimelineEventHandling:99 » IO Job didn't fin...
  TestMRTimelineEventHandling.testMapreduceJobTimelineServiceEnabled:162 » IO Jo...

Tests run: 523, Failures: 0, Errors: 3, Skipped: 11

[INFO] ------------------------------------------------------------------------
[INFO] Reactor Summary:
[INFO] 
[INFO] Apache Hadoop MapReduce Client .................... SUCCESS [  3.781 s]
[INFO] Apache Hadoop MapReduce Core ...................... SUCCESS [02:07 min]
[INFO] Apache Hadoop MapReduce Common .................... SUCCESS [ 36.244 s]
[INFO] Apache Hadoop MapReduce Shuffle ................... SUCCESS [  6.381 s]
[INFO] Apache Hadoop MapReduce App ....................... SUCCESS [10:29 min]
[INFO] Apache Hadoop MapReduce HistoryServer ............. SUCCESS [06:34 min]
[INFO] Apache Hadoop MapReduce JobClient ................. FAILURE [  02:05 h]
[INFO] Apache Hadoop MapReduce HistoryServer Plugins ..... SKIPPED
[INFO] Apache Hadoop MapReduce NativeTask ................ SKIPPED
[INFO] Apache Hadoop MapReduce Examples .................. SKIPPED
[INFO] Apache Hadoop MapReduce ........................... SKIPPED
[INFO] ------------------------------------------------------------------------
[INFO] BUILD FAILURE
[INFO] ------------------------------------------------------------------------
[INFO] Total time: 02:25 h
[INFO] Finished at: 2015-11-02T07:10:33+00:00
[INFO] Final Memory: 35M/751M
[INFO] ------------------------------------------------------------------------
[ERROR] Failed to execute goal org.apache.maven.plugins:maven-surefire-plugin:2.17:test (default-test)
on project hadoop-mapreduce-client-jobclient: There are test failures.
[ERROR] 
[ERROR] Please refer to /home/jenkins/jenkins-slave/workspace/Hadoop-Mapreduce-trunk/hadoop-mapreduce-project/hadoop-mapreduce-client/hadoop-mapreduce-client-jobclient/target/surefire-reports
for the individual test results.
[ERROR] -> [Help 1]
[ERROR] 
[ERROR] To see the full stack trace of the errors, re-run Maven with the -e switch.
[ERROR] Re-run Maven using the -X switch to enable full debug logging.
[ERROR] 
[ERROR] For more information about the errors and possible solutions, please read the following
articles:
[ERROR] [Help 1] http://cwiki.apache.org/confluence/display/MAVEN/MojoFailureException
[ERROR] 
[ERROR] After correcting the problems, you can resume the build with the command
[ERROR]   mvn <goals> -rf :hadoop-mapreduce-client-jobclient
Build step 'Execute shell' marked build as failure
[FINDBUGS] Skipping publisher since build result is FAILURE
Archiving artifacts
Recording test results
Updating HADOOP-12047
Email was triggered for: Failure - Any
Sending email for trigger: Failure - Any



###################################################################################
############################## FAILED TESTS (if any) ##############################
3 tests failed.
FAILED:  org.apache.hadoop.mapred.TestMRTimelineEventHandling.testMRTimelineEventHandling

Error Message:
Job didn't finish in 30 seconds

Stack Trace:
java.io.IOException: Job didn't finish in 30 seconds
	at org.apache.hadoop.mapred.UtilsForTests.runJobSucceed(UtilsForTests.java:622)
	at org.apache.hadoop.mapred.TestMRTimelineEventHandling.testMRTimelineEventHandling(TestMRTimelineEventHandling.java:99)


FAILED:  org.apache.hadoop.mapred.TestMRTimelineEventHandling.testMapreduceJobTimelineServiceEnabled

Error Message:
Job didn't finish in 30 seconds

Stack Trace:
java.io.IOException: Job didn't finish in 30 seconds
	at org.apache.hadoop.mapred.UtilsForTests.runJobSucceed(UtilsForTests.java:622)
	at org.apache.hadoop.mapred.TestMRTimelineEventHandling.testMapreduceJobTimelineServiceEnabled(TestMRTimelineEventHandling.java:162)


FAILED:  org.apache.hadoop.mapreduce.v2.TestMRJobsWithProfiler.testDifferentProfilers

Error Message:
test timed out after 150000 milliseconds

Stack Trace:
java.lang.Exception: test timed out after 150000 milliseconds
	at java.lang.Thread.sleep(Native Method)
	at org.apache.hadoop.mapreduce.Job.monitorAndPrintJob(Job.java:1353)
	at org.apache.hadoop.mapreduce.Job.waitForCompletion(Job.java:1311)
	at org.apache.hadoop.mapreduce.v2.TestMRJobsWithProfiler.testProfilerInternal(TestMRJobsWithProfiler.java:150)
	at org.apache.hadoop.mapreduce.v2.TestMRJobsWithProfiler.testDifferentProfilers(TestMRJobsWithProfiler.java:117)



Mime
  • Unnamed multipart/mixed (inline, None, 0 bytes)
View raw message