hadoop-mapreduce-dev mailing list archives

Site index · List index
Message view « Date » · « Thread »
Top « Date » · « Thread »
From Apache Jenkins Server <jenk...@builds.apache.org>
Subject Hadoop-Mapreduce-trunk - Build # 2684 - Still Failing
Date Thu, 03 Dec 2015 06:59:34 GMT
See https://builds.apache.org/job/Hadoop-Mapreduce-trunk/2684/

###################################################################################
########################## LAST 60 LINES OF THE CONSOLE ###########################
[...truncated 32894 lines...]
Tests run: 1, Failures: 0, Errors: 0, Skipped: 0, Time elapsed: 107.812 sec - in org.apache.hadoop.mapred.TestJobSysDirWithDFS
Running org.apache.hadoop.mapred.TestReduceTask
Tests run: 2, Failures: 0, Errors: 0, Skipped: 0, Time elapsed: 1.507 sec - in org.apache.hadoop.mapred.TestReduceTask
Running org.apache.hadoop.mapred.TestBadRecords
Tests run: 1, Failures: 0, Errors: 0, Skipped: 1, Time elapsed: 0.048 sec - in org.apache.hadoop.mapred.TestBadRecords
Running org.apache.hadoop.mapred.TestMiniMRDFSCaching
Tests run: 1, Failures: 0, Errors: 0, Skipped: 1, Time elapsed: 0.049 sec - in org.apache.hadoop.mapred.TestMiniMRDFSCaching
Running org.apache.hadoop.io.TestSequenceFileMergeProgress
Tests run: 3, Failures: 0, Errors: 0, Skipped: 0, Time elapsed: 2.779 sec - in org.apache.hadoop.io.TestSequenceFileMergeProgress
Running org.apache.hadoop.conf.TestNoDefaultsJobConf
Tests run: 1, Failures: 0, Errors: 0, Skipped: 0, Time elapsed: 25.174 sec - in org.apache.hadoop.conf.TestNoDefaultsJobConf

Results :

Tests in error: 
  TestClusterMRNotification>NotificationTestCase.setUp:145->HadoopTestCase.setUp:157
ยป YarnRuntime

Tests run: 526, Failures: 0, Errors: 1, Skipped: 11

[INFO] ------------------------------------------------------------------------
[INFO] Reactor Summary:
[INFO] 
[INFO] Apache Hadoop MapReduce Client .................... SUCCESS [  3.066 s]
[INFO] Apache Hadoop MapReduce Core ...................... SUCCESS [01:52 min]
[INFO] Apache Hadoop MapReduce Common .................... SUCCESS [ 29.055 s]
[INFO] Apache Hadoop MapReduce Shuffle ................... SUCCESS [  4.875 s]
[INFO] Apache Hadoop MapReduce App ....................... SUCCESS [09:15 min]
[INFO] Apache Hadoop MapReduce HistoryServer ............. SUCCESS [05:35 min]
[INFO] Apache Hadoop MapReduce JobClient ................. FAILURE [  01:42 h]
[INFO] Apache Hadoop MapReduce HistoryServer Plugins ..... SKIPPED
[INFO] Apache Hadoop MapReduce NativeTask ................ SKIPPED
[INFO] Apache Hadoop MapReduce Examples .................. SKIPPED
[INFO] Apache Hadoop MapReduce ........................... SKIPPED
[INFO] ------------------------------------------------------------------------
[INFO] BUILD FAILURE
[INFO] ------------------------------------------------------------------------
[INFO] Total time: 01:59 h
[INFO] Finished at: 2015-12-03T06:59:17+00:00
[INFO] Final Memory: 36M/602M
[INFO] ------------------------------------------------------------------------
[ERROR] Failed to execute goal org.apache.maven.plugins:maven-surefire-plugin:2.17:test (default-test)
on project hadoop-mapreduce-client-jobclient: There are test failures.
[ERROR] 
[ERROR] Please refer to /home/jenkins/jenkins-slave/workspace/Hadoop-Mapreduce-trunk/hadoop-mapreduce-project/hadoop-mapreduce-client/hadoop-mapreduce-client-jobclient/target/surefire-reports
for the individual test results.
[ERROR] -> [Help 1]
[ERROR] 
[ERROR] To see the full stack trace of the errors, re-run Maven with the -e switch.
[ERROR] Re-run Maven using the -X switch to enable full debug logging.
[ERROR] 
[ERROR] For more information about the errors and possible solutions, please read the following
articles:
[ERROR] [Help 1] http://cwiki.apache.org/confluence/display/MAVEN/MojoFailureException
[ERROR] 
[ERROR] After correcting the problems, you can resume the build with the command
[ERROR]   mvn <goals> -rf :hadoop-mapreduce-client-jobclient
Build step 'Execute shell' marked build as failure
[FINDBUGS] Skipping publisher since build result is FAILURE
Archiving artifacts
Recording test results
Email was triggered for: Failure - Any
Sending email for trigger: Failure - Any



###################################################################################
############################## FAILED TESTS (if any) ##############################
1 tests failed.
FAILED:  org.apache.hadoop.mapred.TestClusterMRNotification.testMR

Error Message:
org.apache.hadoop.yarn.exceptions.YarnRuntimeException: Failed to intialize existing directories

Stack Trace:
org.apache.hadoop.yarn.exceptions.YarnRuntimeException: org.apache.hadoop.yarn.exceptions.YarnRuntimeException:
Failed to intialize existing directories
	at org.apache.hadoop.mapreduce.v2.MiniMRYarnCluster$JobHistoryServerWrapper.serviceStart(MiniMRYarnCluster.java:250)
	at org.apache.hadoop.service.AbstractService.start(AbstractService.java:193)
	at org.apache.hadoop.service.CompositeService.serviceStart(CompositeService.java:120)
	at org.apache.hadoop.mapreduce.v2.MiniMRYarnCluster.serviceStart(MiniMRYarnCluster.java:191)
	at org.apache.hadoop.service.AbstractService.start(AbstractService.java:193)
	at org.apache.hadoop.mapred.MiniMRClientClusterFactory.create(MiniMRClientClusterFactory.java:80)
	at org.apache.hadoop.mapred.MiniMRCluster.<init>(MiniMRCluster.java:187)
	at org.apache.hadoop.mapred.MiniMRCluster.<init>(MiniMRCluster.java:175)
	at org.apache.hadoop.mapred.MiniMRCluster.<init>(MiniMRCluster.java:167)
	at org.apache.hadoop.mapred.MiniMRCluster.<init>(MiniMRCluster.java:159)
	at org.apache.hadoop.mapred.MiniMRCluster.<init>(MiniMRCluster.java:152)
	at org.apache.hadoop.mapred.MiniMRCluster.<init>(MiniMRCluster.java:145)
	at org.apache.hadoop.mapred.MiniMRCluster.<init>(MiniMRCluster.java:138)
	at org.apache.hadoop.mapred.MiniMRCluster.<init>(MiniMRCluster.java:133)
	at org.apache.hadoop.mapred.HadoopTestCase.setUp(HadoopTestCase.java:157)
	at org.apache.hadoop.mapred.NotificationTestCase.setUp(NotificationTestCase.java:145)
	at junit.framework.TestCase.runBare(TestCase.java:139)
	at junit.framework.TestResult$1.protect(TestResult.java:122)
	at junit.framework.TestResult.runProtected(TestResult.java:142)
	at junit.framework.TestResult.run(TestResult.java:125)
	at junit.framework.TestCase.run(TestCase.java:129)
	at junit.framework.TestSuite.runTest(TestSuite.java:255)
	at junit.framework.TestSuite.run(TestSuite.java:250)
	at org.junit.internal.runners.JUnit38ClassRunner.run(JUnit38ClassRunner.java:84)
	at org.apache.maven.surefire.junit4.JUnit4Provider.execute(JUnit4Provider.java:264)
	at org.apache.maven.surefire.junit4.JUnit4Provider.executeTestSet(JUnit4Provider.java:153)
	at org.apache.maven.surefire.junit4.JUnit4Provider.invoke(JUnit4Provider.java:124)
	at org.apache.maven.surefire.booter.ForkedBooter.invokeProviderInSameClassLoader(ForkedBooter.java:200)
	at org.apache.maven.surefire.booter.ForkedBooter.runSuitesInProcess(ForkedBooter.java:153)
	at org.apache.maven.surefire.booter.ForkedBooter.main(ForkedBooter.java:103)
Caused by: org.apache.hadoop.yarn.exceptions.YarnRuntimeException: Failed to intialize existing
directories
	at org.apache.hadoop.mapreduce.v2.hs.JobHistory.serviceInit(JobHistory.java:99)
	at org.apache.hadoop.service.AbstractService.init(AbstractService.java:163)
	at org.apache.hadoop.service.CompositeService.serviceInit(CompositeService.java:107)
	at org.apache.hadoop.mapreduce.v2.hs.JobHistoryServer.serviceInit(JobHistoryServer.java:151)
	at org.apache.hadoop.service.AbstractService.init(AbstractService.java:163)
	at org.apache.hadoop.mapreduce.v2.MiniMRYarnCluster$JobHistoryServerWrapper.serviceStart(MiniMRYarnCluster.java:232)
	at org.apache.hadoop.service.AbstractService.start(AbstractService.java:193)
	at org.apache.hadoop.service.CompositeService.serviceStart(CompositeService.java:120)
	at org.apache.hadoop.mapreduce.v2.MiniMRYarnCluster.serviceStart(MiniMRYarnCluster.java:191)
	at org.apache.hadoop.service.AbstractService.start(AbstractService.java:193)
	at org.apache.hadoop.mapred.MiniMRClientClusterFactory.create(MiniMRClientClusterFactory.java:80)
	at org.apache.hadoop.mapred.MiniMRCluster.<init>(MiniMRCluster.java:187)
	at org.apache.hadoop.mapred.MiniMRCluster.<init>(MiniMRCluster.java:175)
	at org.apache.hadoop.mapred.MiniMRCluster.<init>(MiniMRCluster.java:167)
	at org.apache.hadoop.mapred.MiniMRCluster.<init>(MiniMRCluster.java:159)
	at org.apache.hadoop.mapred.MiniMRCluster.<init>(MiniMRCluster.java:152)
	at org.apache.hadoop.mapred.MiniMRCluster.<init>(MiniMRCluster.java:145)
	at org.apache.hadoop.mapred.MiniMRCluster.<init>(MiniMRCluster.java:138)
	at org.apache.hadoop.mapred.MiniMRCluster.<init>(MiniMRCluster.java:133)
	at org.apache.hadoop.mapred.HadoopTestCase.setUp(HadoopTestCase.java:157)
	at org.apache.hadoop.mapred.NotificationTestCase.setUp(NotificationTestCase.java:145)
	at junit.framework.TestCase.runBare(TestCase.java:139)
	at junit.framework.TestResult$1.protect(TestResult.java:122)
	at junit.framework.TestResult.runProtected(TestResult.java:142)
	at junit.framework.TestResult.run(TestResult.java:125)
	at junit.framework.TestCase.run(TestCase.java:129)
	at junit.framework.TestSuite.runTest(TestSuite.java:255)
	at junit.framework.TestSuite.run(TestSuite.java:250)
	at org.junit.internal.runners.JUnit38ClassRunner.run(JUnit38ClassRunner.java:84)
	at org.apache.maven.surefire.junit4.JUnit4Provider.execute(JUnit4Provider.java:264)
	at org.apache.maven.surefire.junit4.JUnit4Provider.executeTestSet(JUnit4Provider.java:153)
	at org.apache.maven.surefire.junit4.JUnit4Provider.invoke(JUnit4Provider.java:124)
	at org.apache.maven.surefire.booter.ForkedBooter.invokeProviderInSameClassLoader(ForkedBooter.java:200)
	at org.apache.maven.surefire.booter.ForkedBooter.runSuitesInProcess(ForkedBooter.java:153)
	at org.apache.maven.surefire.booter.ForkedBooter.main(ForkedBooter.java:103)
Caused by: java.io.FileNotFoundException: File file:/tmp/hadoop-yarn/staging/history/done
does not exist
	at org.apache.hadoop.fs.RawLocalFileSystem.listStatus(RawLocalFileSystem.java:460)
	at org.apache.hadoop.fs.DelegateToFileSystem.listStatus(DelegateToFileSystem.java:168)
	at org.apache.hadoop.fs.ChecksumFs.listStatus(ChecksumFs.java:521)
	at org.apache.hadoop.fs.AbstractFileSystem$1.<init>(AbstractFileSystem.java:890)
	at org.apache.hadoop.fs.AbstractFileSystem.listStatusIterator(AbstractFileSystem.java:888)
	at org.apache.hadoop.fs.FileContext$22.next(FileContext.java:1492)
	at org.apache.hadoop.fs.FileContext$22.next(FileContext.java:1487)
	at org.apache.hadoop.fs.FSLinkResolver.resolve(FSLinkResolver.java:90)
	at org.apache.hadoop.fs.FileContext.listStatus(FileContext.java:1494)
	at org.apache.hadoop.mapreduce.v2.jobhistory.JobHistoryUtils.localGlobber(JobHistoryUtils.java:456)
	at org.apache.hadoop.mapreduce.v2.jobhistory.JobHistoryUtils.localGlobber(JobHistoryUtils.java:444)
	at org.apache.hadoop.mapreduce.v2.jobhistory.JobHistoryUtils.localGlobber(JobHistoryUtils.java:439)
	at org.apache.hadoop.mapreduce.v2.hs.HistoryFileManager.findTimestampedDirectories(HistoryFileManager.java:778)
	at org.apache.hadoop.mapreduce.v2.hs.HistoryFileManager.initExisting(HistoryFileManager.java:672)
	at org.apache.hadoop.mapreduce.v2.hs.JobHistory.serviceInit(JobHistory.java:97)
	at org.apache.hadoop.service.AbstractService.init(AbstractService.java:163)
	at org.apache.hadoop.service.CompositeService.serviceInit(CompositeService.java:107)
	at org.apache.hadoop.mapreduce.v2.hs.JobHistoryServer.serviceInit(JobHistoryServer.java:151)
	at org.apache.hadoop.service.AbstractService.init(AbstractService.java:163)
	at org.apache.hadoop.mapreduce.v2.MiniMRYarnCluster$JobHistoryServerWrapper.serviceStart(MiniMRYarnCluster.java:232)
	at org.apache.hadoop.service.AbstractService.start(AbstractService.java:193)
	at org.apache.hadoop.service.CompositeService.serviceStart(CompositeService.java:120)
	at org.apache.hadoop.mapreduce.v2.MiniMRYarnCluster.serviceStart(MiniMRYarnCluster.java:191)
	at org.apache.hadoop.service.AbstractService.start(AbstractService.java:193)
	at org.apache.hadoop.mapred.MiniMRClientClusterFactory.create(MiniMRClientClusterFactory.java:80)
	at org.apache.hadoop.mapred.MiniMRCluster.<init>(MiniMRCluster.java:187)
	at org.apache.hadoop.mapred.MiniMRCluster.<init>(MiniMRCluster.java:175)
	at org.apache.hadoop.mapred.MiniMRCluster.<init>(MiniMRCluster.java:167)
	at org.apache.hadoop.mapred.MiniMRCluster.<init>(MiniMRCluster.java:159)
	at org.apache.hadoop.mapred.MiniMRCluster.<init>(MiniMRCluster.java:152)
	at org.apache.hadoop.mapred.MiniMRCluster.<init>(MiniMRCluster.java:145)
	at org.apache.hadoop.mapred.MiniMRCluster.<init>(MiniMRCluster.java:138)
	at org.apache.hadoop.mapred.MiniMRCluster.<init>(MiniMRCluster.java:133)
	at org.apache.hadoop.mapred.HadoopTestCase.setUp(HadoopTestCase.java:157)
	at org.apache.hadoop.mapred.NotificationTestCase.setUp(NotificationTestCase.java:145)
	at junit.framework.TestCase.runBare(TestCase.java:139)
	at junit.framework.TestResult$1.protect(TestResult.java:122)
	at junit.framework.TestResult.runProtected(TestResult.java:142)
	at junit.framework.TestResult.run(TestResult.java:125)
	at junit.framework.TestCase.run(TestCase.java:129)
	at junit.framework.TestSuite.runTest(TestSuite.java:255)
	at junit.framework.TestSuite.run(TestSuite.java:250)
	at org.junit.internal.runners.JUnit38ClassRunner.run(JUnit38ClassRunner.java:84)
	at org.apache.maven.surefire.junit4.JUnit4Provider.execute(JUnit4Provider.java:264)
	at org.apache.maven.surefire.junit4.JUnit4Provider.executeTestSet(JUnit4Provider.java:153)
	at org.apache.maven.surefire.junit4.JUnit4Provider.invoke(JUnit4Provider.java:124)
	at org.apache.maven.surefire.booter.ForkedBooter.invokeProviderInSameClassLoader(ForkedBooter.java:200)
	at org.apache.maven.surefire.booter.ForkedBooter.runSuitesInProcess(ForkedBooter.java:153)
	at org.apache.maven.surefire.booter.ForkedBooter.main(ForkedBooter.java:103)



Mime
  • Unnamed multipart/mixed (inline, None, 0 bytes)
View raw message