hadoop-mapreduce-dev mailing list archives

Site index · List index
Message view « Date » · « Thread »
Top « Date » · « Thread »
From Apache Jenkins Server <jenk...@builds.apache.org>
Subject Hadoop-Mapreduce-trunk - Build # 2705 - Failure
Date Wed, 09 Dec 2015 07:25:20 GMT
See https://builds.apache.org/job/Hadoop-Mapreduce-trunk/2705/

###################################################################################
########################## LAST 60 LINES OF THE CONSOLE ###########################
[...truncated 32451 lines...]
Running org.apache.hadoop.mapreduce.v2.app.webapp.TestAMWebApp
Tests run: 12, Failures: 0, Errors: 0, Skipped: 0, Time elapsed: 51.482 sec - in org.apache.hadoop.mapreduce.v2.app.webapp.TestAMWebApp
Running org.apache.hadoop.mapreduce.v2.app.webapp.TestAMWebServicesJobConf
Tests run: 4, Failures: 0, Errors: 0, Skipped: 0, Time elapsed: 17.337 sec - in org.apache.hadoop.mapreduce.v2.app.webapp.TestAMWebServicesJobConf
Running org.apache.hadoop.mapred.TestTaskAttemptListenerImpl
Tests run: 6, Failures: 0, Errors: 0, Skipped: 0, Time elapsed: 3.813 sec - in org.apache.hadoop.mapred.TestTaskAttemptListenerImpl
Running org.apache.hadoop.mapred.TestTaskAttemptFinishingMonitor
Tests run: 1, Failures: 0, Errors: 0, Skipped: 0, Time elapsed: 4.498 sec - in org.apache.hadoop.mapred.TestTaskAttemptFinishingMonitor
Running org.apache.hadoop.mapred.TestLocalContainerLauncher
Tests run: 2, Failures: 0, Errors: 0, Skipped: 0, Time elapsed: 4.548 sec - in org.apache.hadoop.mapred.TestLocalContainerLauncher

Results :

Tests in error: 
  TestContainerLauncher.testSlowNM:292 »  test timed out after 15000 millisecond...
  TestRMCommunicator.testRMContainerAllocatorExceptionIsHandled:57 »  test timed...

Tests run: 340, Failures: 0, Errors: 2, Skipped: 0

[INFO] ------------------------------------------------------------------------
[INFO] Reactor Summary:
[INFO] 
[INFO] Apache Hadoop MapReduce Client .................... SUCCESS [ 10.474 s]
[INFO] Apache Hadoop MapReduce Core ...................... SUCCESS [06:01 min]
[INFO] Apache Hadoop MapReduce Common .................... SUCCESS [01:18 min]
[INFO] Apache Hadoop MapReduce Shuffle ................... SUCCESS [ 15.316 s]
[INFO] Apache Hadoop MapReduce App ....................... FAILURE [19:36 min]
[INFO] Apache Hadoop MapReduce HistoryServer ............. SKIPPED
[INFO] Apache Hadoop MapReduce JobClient ................. SKIPPED
[INFO] Apache Hadoop MapReduce HistoryServer Plugins ..... SKIPPED
[INFO] Apache Hadoop MapReduce NativeTask ................ SKIPPED
[INFO] Apache Hadoop MapReduce Examples .................. SKIPPED
[INFO] Apache Hadoop MapReduce ........................... SKIPPED
[INFO] ------------------------------------------------------------------------
[INFO] BUILD FAILURE
[INFO] ------------------------------------------------------------------------
[INFO] Total time: 27:25 min
[INFO] Finished at: 2015-12-09T07:25:04+00:00
[INFO] Final Memory: 50M/1214M
[INFO] ------------------------------------------------------------------------
[ERROR] Failed to execute goal org.apache.maven.plugins:maven-surefire-plugin:2.17:test (default-test)
on project hadoop-mapreduce-client-app: There are test failures.
[ERROR] 
[ERROR] Please refer to /home/jenkins/jenkins-slave/workspace/Hadoop-Mapreduce-trunk/hadoop-mapreduce-project/hadoop-mapreduce-client/hadoop-mapreduce-client-app/target/surefire-reports
for the individual test results.
[ERROR] -> [Help 1]
[ERROR] 
[ERROR] To see the full stack trace of the errors, re-run Maven with the -e switch.
[ERROR] Re-run Maven using the -X switch to enable full debug logging.
[ERROR] 
[ERROR] For more information about the errors and possible solutions, please read the following
articles:
[ERROR] [Help 1] http://cwiki.apache.org/confluence/display/MAVEN/MojoFailureException
[ERROR] 
[ERROR] After correcting the problems, you can resume the build with the command
[ERROR]   mvn <goals> -rf :hadoop-mapreduce-client-app
Build step 'Execute shell' marked build as failure
[FINDBUGS] Skipping publisher since build result is FAILURE
Archiving artifacts
Recording test results
Email was triggered for: Failure - Any
Sending email for trigger: Failure - Any



###################################################################################
############################## FAILED TESTS (if any) ##############################
2 tests failed.
FAILED:  org.apache.hadoop.mapreduce.v2.app.launcher.TestContainerLauncher.testSlowNM

Error Message:
test timed out after 15000 milliseconds

Stack Trace:
java.lang.Exception: test timed out after 15000 milliseconds
	at java.lang.Thread.sleep(Native Method)
	at org.apache.hadoop.mapreduce.v2.app.MRApp.waitForState(MRApp.java:408)
	at org.apache.hadoop.mapreduce.v2.app.launcher.TestContainerLauncher.testSlowNM(TestContainerLauncher.java:292)


FAILED:  org.apache.hadoop.mapreduce.v2.app.rm.TestRMCommunicator.testRMContainerAllocatorExceptionIsHandled

Error Message:
test timed out after 2000 milliseconds

Stack Trace:
java.lang.Exception: test timed out after 2000 milliseconds
	at java.util.concurrent.ConcurrentLinkedQueue.add(ConcurrentLinkedQueue.java:296)
	at org.mockito.internal.stubbing.StubbedInvocationMatcher.<init>(StubbedInvocationMatcher.java:25)
	at org.mockito.internal.stubbing.InvocationContainerImpl.addAnswer(InvocationContainerImpl.java:62)
	at org.mockito.internal.stubbing.InvocationContainerImpl.addAnswer(InvocationContainerImpl.java:46)
	at org.mockito.internal.stubbing.OngoingStubbingImpl.thenAnswer(OngoingStubbingImpl.java:23)
	at org.mockito.internal.stubbing.BaseStubbing.thenReturn(BaseStubbing.java:15)
	at org.apache.hadoop.mapreduce.v2.app.rm.TestRMCommunicator.testRMContainerAllocatorExceptionIsHandled(TestRMCommunicator.java:57)



Mime
  • Unnamed multipart/mixed (inline, None, 0 bytes)
View raw message