hadoop-mapreduce-dev mailing list archives

Site index · List index
Message view « Date » · « Thread »
Top « Date » · « Thread »
From Apache Jenkins Server <jenk...@builds.apache.org>
Subject Hadoop-Mapreduce-trunk-Java8 - Build # 739 - Still Failing
Date Wed, 02 Dec 2015 03:06:49 GMT
See https://builds.apache.org/job/Hadoop-Mapreduce-trunk-Java8/739/

###################################################################################
########################## LAST 60 LINES OF THE CONSOLE ###########################
[...truncated 13534 lines...]
Running org.apache.hadoop.mapred.pipes.TestPipeApplication
Tests run: 5, Failures: 0, Errors: 0, Skipped: 0, Time elapsed: 8.522 sec - in org.apache.hadoop.mapred.pipes.TestPipeApplication
Java HotSpot(TM) 64-Bit Server VM warning: ignoring option MaxPermSize=768m; support was removed
in 8.0
Running org.apache.hadoop.mapred.pipes.TestPipes
Tests run: 1, Failures: 0, Errors: 0, Skipped: 1, Time elapsed: 0.034 sec - in org.apache.hadoop.mapred.pipes.TestPipes
Java HotSpot(TM) 64-Bit Server VM warning: ignoring option MaxPermSize=768m; support was removed
in 8.0
Running org.apache.hadoop.mapred.TestSpecialCharactersInOutputPath
Tests run: 1, Failures: 0, Errors: 0, Skipped: 0, Time elapsed: 30.479 sec - in org.apache.hadoop.mapred.TestSpecialCharactersInOutputPath
Java HotSpot(TM) 64-Bit Server VM warning: ignoring option MaxPermSize=768m; support was removed
in 8.0
Running org.apache.hadoop.mapred.TestReporter
Tests run: 3, Failures: 0, Errors: 0, Skipped: 0, Time elapsed: 13.794 sec - in org.apache.hadoop.mapred.TestReporter

Results :

Tests in error: 
  TestMRJobsWithProfiler.testDifferentProfilers:117->testProfilerInternal:155 ยป 

Tests run: 526, Failures: 0, Errors: 1, Skipped: 11

[INFO] ------------------------------------------------------------------------
[INFO] Reactor Summary:
[INFO] 
[INFO] Apache Hadoop MapReduce Client .................... SUCCESS [  3.805 s]
[INFO] Apache Hadoop MapReduce Core ...................... SUCCESS [02:27 min]
[INFO] Apache Hadoop MapReduce Common .................... SUCCESS [ 38.694 s]
[INFO] Apache Hadoop MapReduce Shuffle ................... SUCCESS [  5.487 s]
[INFO] Apache Hadoop MapReduce App ....................... SUCCESS [13:38 min]
[INFO] Apache Hadoop MapReduce HistoryServer ............. SUCCESS [07:06 min]
[INFO] Apache Hadoop MapReduce JobClient ................. FAILURE [  01:51 h]
[INFO] Apache Hadoop MapReduce HistoryServer Plugins ..... SKIPPED
[INFO] Apache Hadoop MapReduce NativeTask ................ SKIPPED
[INFO] Apache Hadoop MapReduce Examples .................. SKIPPED
[INFO] Apache Hadoop MapReduce ........................... SKIPPED
[INFO] ------------------------------------------------------------------------
[INFO] BUILD FAILURE
[INFO] ------------------------------------------------------------------------
[INFO] Total time: 02:15 h
[INFO] Finished at: 2015-12-02T03:06:29+00:00
[INFO] Final Memory: 34M/193M
[INFO] ------------------------------------------------------------------------
[ERROR] Failed to execute goal org.apache.maven.plugins:maven-surefire-plugin:2.17:test (default-test)
on project hadoop-mapreduce-client-jobclient: There are test failures.
[ERROR] 
[ERROR] Please refer to /home/jenkins/jenkins-slave/workspace/Hadoop-Mapreduce-trunk-Java8/hadoop-mapreduce-project/hadoop-mapreduce-client/hadoop-mapreduce-client-jobclient/target/surefire-reports
for the individual test results.
[ERROR] -> [Help 1]
[ERROR] 
[ERROR] To see the full stack trace of the errors, re-run Maven with the -e switch.
[ERROR] Re-run Maven using the -X switch to enable full debug logging.
[ERROR] 
[ERROR] For more information about the errors and possible solutions, please read the following
articles:
[ERROR] [Help 1] http://cwiki.apache.org/confluence/display/MAVEN/MojoFailureException
[ERROR] 
[ERROR] After correcting the problems, you can resume the build with the command
[ERROR]   mvn <goals> -rf :hadoop-mapreduce-client-jobclient
Build step 'Execute shell' marked build as failure
[FINDBUGS] Skipping publisher since build result is FAILURE
Archiving artifacts
Recording test results
Email was triggered for: Failure - Any
Sending email for trigger: Failure - Any



###################################################################################
############################## FAILED TESTS (if any) ##############################
1 tests failed.
FAILED:  org.apache.hadoop.mapreduce.v2.TestMRJobsWithProfiler.testDifferentProfilers

Error Message:
test timed out after 150000 milliseconds

Stack Trace:
java.lang.Exception: test timed out after 150000 milliseconds
	at java.lang.Thread.sleep(Native Method)
	at org.apache.hadoop.mapreduce.v2.TestMRJobsWithProfiler.testProfilerInternal(TestMRJobsWithProfiler.java:155)
	at org.apache.hadoop.mapreduce.v2.TestMRJobsWithProfiler.testDifferentProfilers(TestMRJobsWithProfiler.java:117)



Mime
  • Unnamed multipart/mixed (inline, None, 0 bytes)
View raw message