hadoop-mapreduce-dev mailing list archives

Site index · List index
Message view « Date » · « Thread »
Top « Date » · « Thread »
From Apache Jenkins Server <jenk...@builds.apache.org>
Subject Hadoop-Mapreduce-trunk - Build # 2694 - Still Failing
Date Sat, 05 Dec 2015 19:01:49 GMT
See https://builds.apache.org/job/Hadoop-Mapreduce-trunk/2694/

###################################################################################
########################## LAST 60 LINES OF THE CONSOLE ###########################
[...truncated 32381 lines...]
Tests run: 25, Failures: 0, Errors: 0, Skipped: 0, Time elapsed: 27.269 sec - in org.apache.hadoop.mapreduce.v2.hs.webapp.TestHsWebServicesJobsQuery
Running org.apache.hadoop.mapreduce.v2.hs.webapp.TestHsWebServicesAttempts
Tests run: 15, Failures: 0, Errors: 0, Skipped: 0, Time elapsed: 20.459 sec - in org.apache.hadoop.mapreduce.v2.hs.webapp.TestHsWebServicesAttempts
Running org.apache.hadoop.mapreduce.v2.hs.webapp.TestHsWebServices
Tests run: 11, Failures: 0, Errors: 0, Skipped: 0, Time elapsed: 16.795 sec - in org.apache.hadoop.mapreduce.v2.hs.webapp.TestHsWebServices
Running org.apache.hadoop.mapreduce.v2.hs.webapp.TestBlocks
Tests run: 5, Failures: 0, Errors: 0, Skipped: 0, Time elapsed: 3.536 sec - in org.apache.hadoop.mapreduce.v2.hs.webapp.TestBlocks
Running org.apache.hadoop.mapreduce.v2.hs.webapp.TestHSWebApp
Tests run: 15, Failures: 0, Errors: 0, Skipped: 0, Time elapsed: 21.918 sec - in org.apache.hadoop.mapreduce.v2.hs.webapp.TestHSWebApp
Running org.apache.hadoop.mapreduce.v2.hs.TestCompletedTask
Tests run: 2, Failures: 0, Errors: 0, Skipped: 0, Time elapsed: 1.775 sec - in org.apache.hadoop.mapreduce.v2.hs.TestCompletedTask

Results :

Tests in error: 
  TestJobListCache.testAddExisting:38 ยป  test timed out after 1000 milliseconds

Tests run: 198, Failures: 0, Errors: 1, Skipped: 0

[INFO] ------------------------------------------------------------------------
[INFO] Reactor Summary:
[INFO] 
[INFO] Apache Hadoop MapReduce Client .................... SUCCESS [  7.892 s]
[INFO] Apache Hadoop MapReduce Core ...................... SUCCESS [04:12 min]
[INFO] Apache Hadoop MapReduce Common .................... SUCCESS [01:03 min]
[INFO] Apache Hadoop MapReduce Shuffle ................... SUCCESS [ 12.209 s]
[INFO] Apache Hadoop MapReduce App ....................... SUCCESS [14:55 min]
[INFO] Apache Hadoop MapReduce HistoryServer ............. FAILURE [08:39 min]
[INFO] Apache Hadoop MapReduce JobClient ................. SKIPPED
[INFO] Apache Hadoop MapReduce HistoryServer Plugins ..... SKIPPED
[INFO] Apache Hadoop MapReduce NativeTask ................ SKIPPED
[INFO] Apache Hadoop MapReduce Examples .................. SKIPPED
[INFO] Apache Hadoop MapReduce ........................... SKIPPED
[INFO] ------------------------------------------------------------------------
[INFO] BUILD FAILURE
[INFO] ------------------------------------------------------------------------
[INFO] Total time: 29:13 min
[INFO] Finished at: 2015-12-05T19:01:39+00:00
[INFO] Final Memory: 47M/1228M
[INFO] ------------------------------------------------------------------------
[ERROR] Failed to execute goal org.apache.maven.plugins:maven-surefire-plugin:2.17:test (default-test)
on project hadoop-mapreduce-client-hs: There are test failures.
[ERROR] 
[ERROR] Please refer to /home/jenkins/jenkins-slave/workspace/Hadoop-Mapreduce-trunk/hadoop-mapreduce-project/hadoop-mapreduce-client/hadoop-mapreduce-client-hs/target/surefire-reports
for the individual test results.
[ERROR] -> [Help 1]
[ERROR] 
[ERROR] To see the full stack trace of the errors, re-run Maven with the -e switch.
[ERROR] Re-run Maven using the -X switch to enable full debug logging.
[ERROR] 
[ERROR] For more information about the errors and possible solutions, please read the following
articles:
[ERROR] [Help 1] http://cwiki.apache.org/confluence/display/MAVEN/MojoFailureException
[ERROR] 
[ERROR] After correcting the problems, you can resume the build with the command
[ERROR]   mvn <goals> -rf :hadoop-mapreduce-client-hs
Build step 'Execute shell' marked build as failure
[FINDBUGS] Skipping publisher since build result is FAILURE
Archiving artifacts
Recording test results
Email was triggered for: Failure - Any
Sending email for trigger: Failure - Any



###################################################################################
############################## FAILED TESTS (if any) ##############################
1 tests failed.
FAILED:  org.apache.hadoop.mapreduce.v2.hs.TestJobListCache.testAddExisting

Error Message:
test timed out after 1000 milliseconds

Stack Trace:
java.lang.Exception: test timed out after 1000 milliseconds
	at java.lang.Class.forName0(Native Method)
	at java.lang.Class.forName(Class.java:270)
	at org.apache.hadoop.conf.Configuration.getClassByNameOrNull(Configuration.java:2198)
	at org.apache.hadoop.conf.Configuration.getClassByName(Configuration.java:2163)
	at org.apache.hadoop.yarn.factories.impl.pb.RecordFactoryPBImpl.newRecordInstance(RecordFactoryPBImpl.java:56)
	at org.apache.hadoop.yarn.util.Records.newRecord(Records.java:36)
	at org.apache.hadoop.mapreduce.v2.util.MRBuilderUtils.newJobId(MRBuilderUtils.java:39)
	at org.apache.hadoop.mapreduce.v2.util.MRBuilderUtils.newJobId(MRBuilderUtils.java:47)
	at org.apache.hadoop.mapreduce.v2.hs.TestJobListCache.testAddExisting(TestJobListCache.java:38)



Mime
  • Unnamed multipart/mixed (inline, None, 0 bytes)
View raw message