hadoop-mapreduce-dev mailing list archives

Site index · List index
Message view « Date » · « Thread »
Top « Date » · « Thread »
From Apache Jenkins Server <jenk...@builds.apache.org>
Subject Hadoop-Mapreduce-trunk-Java8 - Build # 736 - Still Failing
Date Tue, 01 Dec 2015 19:47:03 GMT
See https://builds.apache.org/job/Hadoop-Mapreduce-trunk-Java8/736/

###################################################################################
########################## LAST 60 LINES OF THE CONSOLE ###########################
[...truncated 10211 lines...]
	at org.apache.hadoop.mapreduce.v2.hs.TestJobListCache.testAddExisting(TestJobListCache.java:39)

Java HotSpot(TM) 64-Bit Server VM warning: ignoring option MaxPermSize=768m; support was removed
in 8.0
Running org.apache.hadoop.mapreduce.v2.hs.TestJobHistoryEvents
Tests run: 4, Failures: 0, Errors: 0, Skipped: 0, Time elapsed: 45.173 sec - in org.apache.hadoop.mapreduce.v2.hs.TestJobHistoryEvents
Java HotSpot(TM) 64-Bit Server VM warning: ignoring option MaxPermSize=768m; support was removed
in 8.0
Running org.apache.hadoop.mapreduce.v2.hs.TestCompletedTask
Tests run: 2, Failures: 0, Errors: 0, Skipped: 0, Time elapsed: 1.063 sec - in org.apache.hadoop.mapreduce.v2.hs.TestCompletedTask
Java HotSpot(TM) 64-Bit Server VM warning: ignoring option MaxPermSize=768m; support was removed
in 8.0
Running org.apache.hadoop.mapreduce.v2.hs.TestHistoryFileManager
Tests run: 8, Failures: 0, Errors: 0, Skipped: 0, Time elapsed: 23.334 sec - in org.apache.hadoop.mapreduce.v2.hs.TestHistoryFileManager

Results :

Tests in error: 
  TestJobListCache.testAddExisting:39 ยป  test timed out after 1000 milliseconds

Tests run: 198, Failures: 0, Errors: 1, Skipped: 0

[INFO] ------------------------------------------------------------------------
[INFO] Reactor Summary:
[INFO] 
[INFO] Apache Hadoop MapReduce Client .................... SUCCESS [  3.236 s]
[INFO] Apache Hadoop MapReduce Core ...................... SUCCESS [02:07 min]
[INFO] Apache Hadoop MapReduce Common .................... SUCCESS [ 34.314 s]
[INFO] Apache Hadoop MapReduce Shuffle ................... SUCCESS [  5.357 s]
[INFO] Apache Hadoop MapReduce App ....................... SUCCESS [12:09 min]
[INFO] Apache Hadoop MapReduce HistoryServer ............. FAILURE [07:13 min]
[INFO] Apache Hadoop MapReduce JobClient ................. SKIPPED
[INFO] Apache Hadoop MapReduce HistoryServer Plugins ..... SKIPPED
[INFO] Apache Hadoop MapReduce NativeTask ................ SKIPPED
[INFO] Apache Hadoop MapReduce Examples .................. SKIPPED
[INFO] Apache Hadoop MapReduce ........................... SKIPPED
[INFO] ------------------------------------------------------------------------
[INFO] BUILD FAILURE
[INFO] ------------------------------------------------------------------------
[INFO] Total time: 22:14 min
[INFO] Finished at: 2015-12-01T19:46:52+00:00
[INFO] Final Memory: 45M/327M
[INFO] ------------------------------------------------------------------------
[ERROR] Failed to execute goal org.apache.maven.plugins:maven-surefire-plugin:2.17:test (default-test)
on project hadoop-mapreduce-client-hs: There are test failures.
[ERROR] 
[ERROR] Please refer to /home/jenkins/jenkins-slave/workspace/Hadoop-Mapreduce-trunk-Java8/hadoop-mapreduce-project/hadoop-mapreduce-client/hadoop-mapreduce-client-hs/target/surefire-reports
for the individual test results.
[ERROR] -> [Help 1]
[ERROR] 
[ERROR] To see the full stack trace of the errors, re-run Maven with the -e switch.
[ERROR] Re-run Maven using the -X switch to enable full debug logging.
[ERROR] 
[ERROR] For more information about the errors and possible solutions, please read the following
articles:
[ERROR] [Help 1] http://cwiki.apache.org/confluence/display/MAVEN/MojoFailureException
[ERROR] 
[ERROR] After correcting the problems, you can resume the build with the command
[ERROR]   mvn <goals> -rf :hadoop-mapreduce-client-hs
Build step 'Execute shell' marked build as failure
[FINDBUGS] Skipping publisher since build result is FAILURE
Archiving artifacts
Recording test results
Email was triggered for: Failure - Any
Sending email for trigger: Failure - Any



###################################################################################
############################## FAILED TESTS (if any) ##############################
1 tests failed.
FAILED:  org.apache.hadoop.mapreduce.v2.hs.TestJobListCache.testAddExisting

Error Message:
test timed out after 1000 milliseconds

Stack Trace:
java.lang.Exception: test timed out after 1000 milliseconds
	at java.util.zip.Inflater.inflateBytes(Native Method)
	at java.util.zip.Inflater.inflate(Inflater.java:259)
	at java.util.zip.InflaterInputStream.read(InflaterInputStream.java:152)
	at sun.misc.Resource.getBytes(Resource.java:124)
	at java.net.URLClassLoader.defineClass(URLClassLoader.java:450)
	at java.net.URLClassLoader.access$100(URLClassLoader.java:73)
	at java.net.URLClassLoader$1.run(URLClassLoader.java:367)
	at java.net.URLClassLoader$1.run(URLClassLoader.java:361)
	at java.security.AccessController.doPrivileged(Native Method)
	at java.net.URLClassLoader.findClass(URLClassLoader.java:360)
	at java.lang.ClassLoader.loadClass(ClassLoader.java:424)
	at sun.misc.Launcher$AppClassLoader.loadClass(Launcher.java:308)
	at java.lang.ClassLoader.loadClass(ClassLoader.java:357)
	at org.apache.hadoop.mapreduce.v2.hs.HistoryFileManager$HistoryFileInfo$$EnhancerByMockitoWithCGLIB$$118627e9.CGLIB$STATICHOOK1(<generated>)
	at org.apache.hadoop.mapreduce.v2.hs.HistoryFileManager$HistoryFileInfo$$EnhancerByMockitoWithCGLIB$$118627e9.<clinit>(<generated>)
	at sun.reflect.GeneratedSerializationConstructorAccessor1.newInstance(Unknown Source)
	at java.lang.reflect.Constructor.newInstance(Constructor.java:408)
	at org.objenesis.instantiator.sun.SunReflectionFactoryInstantiator.newInstance(SunReflectionFactoryInstantiator.java:40)
	at org.objenesis.ObjenesisBase.newInstance(ObjenesisBase.java:59)
	at org.mockito.internal.creation.jmock.ClassImposterizer.createProxy(ClassImposterizer.java:111)
	at org.mockito.internal.creation.jmock.ClassImposterizer.imposterise(ClassImposterizer.java:51)
	at org.mockito.internal.util.MockUtil.createMock(MockUtil.java:54)
	at org.mockito.internal.MockitoCore.mock(MockitoCore.java:45)
	at org.mockito.Mockito.mock(Mockito.java:921)
	at org.mockito.Mockito.mock(Mockito.java:816)
	at org.apache.hadoop.mapreduce.v2.hs.TestJobListCache.testAddExisting(TestJobListCache.java:39)



Mime
  • Unnamed multipart/mixed (inline, None, 0 bytes)
View raw message