hadoop-mapreduce-dev mailing list archives

Site index · List index
Message view « Date » · « Thread »
Top « Date » · « Thread »
From Apache Jenkins Server <jenk...@builds.apache.org>
Subject Hadoop-Mapreduce-trunk - Build # 2729 - Still Failing
Date Wed, 16 Dec 2015 22:29:41 GMT
See https://builds.apache.org/job/Hadoop-Mapreduce-trunk/2729/

###################################################################################
########################## LAST 60 LINES OF THE CONSOLE ###########################
[...truncated 32834 lines...]
Tests run: 2, Failures: 0, Errors: 0, Skipped: 0, Time elapsed: 4.369 sec - in org.apache.hadoop.mapred.TestJavaSerialization
Running org.apache.hadoop.mapred.TestAuditLogger
Tests run: 3, Failures: 0, Errors: 0, Skipped: 0, Time elapsed: 1.32 sec - in org.apache.hadoop.mapred.TestAuditLogger
Running org.apache.hadoop.mapred.pipes.TestPipesNonJavaInputFormat
Tests run: 1, Failures: 0, Errors: 0, Skipped: 0, Time elapsed: 1.362 sec - in org.apache.hadoop.mapred.pipes.TestPipesNonJavaInputFormat
Running org.apache.hadoop.mapred.pipes.TestPipeApplication
Tests run: 5, Failures: 0, Errors: 0, Skipped: 0, Time elapsed: 5.473 sec - in org.apache.hadoop.mapred.pipes.TestPipeApplication
Running org.apache.hadoop.mapred.pipes.TestPipes
Tests run: 1, Failures: 0, Errors: 0, Skipped: 1, Time elapsed: 0.046 sec - in org.apache.hadoop.mapred.pipes.TestPipes
Running org.apache.hadoop.mapred.TestSpecialCharactersInOutputPath
Tests run: 1, Failures: 0, Errors: 0, Skipped: 0, Time elapsed: 26.463 sec - in org.apache.hadoop.mapred.TestSpecialCharactersInOutputPath
Running org.apache.hadoop.mapred.TestReporter
Tests run: 3, Failures: 0, Errors: 0, Skipped: 0, Time elapsed: 13.542 sec - in org.apache.hadoop.mapred.TestReporter

Results :

Failed tests: 
  TestNetworkedJob.testNetworkedJob:174 expected:<[[Wed Dec 16 21:33:52 +0000 2015] Scheduler
has assigned a container for AM, waiting for AM container to be launched]> but was:<[]>
  TestTextInputFormat.testSplitableCodecs:223 Key in multiple partitions.

Tests run: 523, Failures: 2, Errors: 0, Skipped: 11

[INFO] ------------------------------------------------------------------------
[INFO] Reactor Summary:
[INFO] 
[INFO] Apache Hadoop MapReduce Client .................... SUCCESS [  3.088 s]
[INFO] Apache Hadoop MapReduce Core ...................... SUCCESS [01:55 min]
[INFO] Apache Hadoop MapReduce Common .................... SUCCESS [ 29.495 s]
[INFO] Apache Hadoop MapReduce Shuffle ................... SUCCESS [  5.068 s]
[INFO] Apache Hadoop MapReduce App ....................... SUCCESS [09:24 min]
[INFO] Apache Hadoop MapReduce HistoryServer ............. SUCCESS [05:38 min]
[INFO] Apache Hadoop MapReduce JobClient ................. FAILURE [  01:58 h]
[INFO] Apache Hadoop MapReduce HistoryServer Plugins ..... SKIPPED
[INFO] Apache Hadoop MapReduce NativeTask ................ SKIPPED
[INFO] Apache Hadoop MapReduce Examples .................. SKIPPED
[INFO] Apache Hadoop MapReduce ........................... SKIPPED
[INFO] ------------------------------------------------------------------------
[INFO] BUILD FAILURE
[INFO] ------------------------------------------------------------------------
[INFO] Total time: 02:16 h
[INFO] Finished at: 2015-12-16T22:29:32+00:00
[INFO] Final Memory: 41M/981M
[INFO] ------------------------------------------------------------------------
[ERROR] Failed to execute goal org.apache.maven.plugins:maven-surefire-plugin:2.17:test (default-test)
on project hadoop-mapreduce-client-jobclient: There was a timeout or other error in the fork
-> [Help 1]
[ERROR] 
[ERROR] To see the full stack trace of the errors, re-run Maven with the -e switch.
[ERROR] Re-run Maven using the -X switch to enable full debug logging.
[ERROR] 
[ERROR] For more information about the errors and possible solutions, please read the following
articles:
[ERROR] [Help 1] http://cwiki.apache.org/confluence/display/MAVEN/MojoFailureException
[ERROR] 
[ERROR] After correcting the problems, you can resume the build with the command
[ERROR]   mvn <goals> -rf :hadoop-mapreduce-client-jobclient
Build step 'Execute shell' marked build as failure
[FINDBUGS] Skipping publisher since build result is FAILURE
Archiving artifacts
Recording test results
Email was triggered for: Failure - Any
Sending email for trigger: Failure - Any



###################################################################################
############################## FAILED TESTS (if any) ##############################
2 tests failed.
FAILED:  org.apache.hadoop.mapred.TestTextInputFormat.testSplitableCodecs

Error Message:
Key in multiple partitions.

Stack Trace:
java.lang.AssertionError: Key in multiple partitions.
	at org.junit.Assert.fail(Assert.java:88)
	at org.junit.Assert.assertTrue(Assert.java:41)
	at org.junit.Assert.assertFalse(Assert.java:64)
	at org.apache.hadoop.mapred.TestTextInputFormat.testSplitableCodecs(TestTextInputFormat.java:223)


FAILED:  org.apache.hadoop.mapred.TestNetworkedJob.testNetworkedJob

Error Message:
expected:<[[Wed Dec 16 21:33:52 +0000 2015] Scheduler has assigned a container for AM,
waiting for AM container to be launched]> but was:<[]>

Stack Trace:
org.junit.ComparisonFailure: expected:<[[Wed Dec 16 21:33:52 +0000 2015] Scheduler has
assigned a container for AM, waiting for AM container to be launched]> but was:<[]>
	at org.junit.Assert.assertEquals(Assert.java:115)
	at org.junit.Assert.assertEquals(Assert.java:144)
	at org.apache.hadoop.mapred.TestNetworkedJob.testNetworkedJob(TestNetworkedJob.java:174)



Mime
  • Unnamed multipart/mixed (inline, None, 0 bytes)
View raw message