hadoop-mapreduce-dev mailing list archives

Site index · List index
Message view « Date » · « Thread »
Top « Date » · « Thread »
From Apache Jenkins Server <jenk...@builds.apache.org>
Subject Hadoop-Mapreduce-trunk - Build # 2685 - Still Failing
Date Thu, 03 Dec 2015 18:17:51 GMT
See https://builds.apache.org/job/Hadoop-Mapreduce-trunk/2685/

###################################################################################
########################## LAST 60 LINES OF THE CONSOLE ###########################
[...truncated 32763 lines...]
Running org.apache.hadoop.mapred.TestMRIntermediateDataEncryption
Running org.apache.hadoop.mapred.TestMiniMRDFSCaching
Tests run: 1, Failures: 0, Errors: 0, Skipped: 1, Time elapsed: 0.062 sec - in org.apache.hadoop.mapred.TestMiniMRDFSCaching
Running org.apache.hadoop.mapred.TestJavaSerialization
Tests run: 2, Failures: 0, Errors: 0, Skipped: 0, Time elapsed: 4.817 sec - in org.apache.hadoop.mapred.TestJavaSerialization
Running org.apache.hadoop.mapred.TestAuditLogger
Tests run: 3, Failures: 0, Errors: 0, Skipped: 0, Time elapsed: 1.457 sec - in org.apache.hadoop.mapred.TestAuditLogger
Running org.apache.hadoop.mapred.pipes.TestPipesNonJavaInputFormat
Tests run: 1, Failures: 0, Errors: 0, Skipped: 0, Time elapsed: 1.54 sec - in org.apache.hadoop.mapred.pipes.TestPipesNonJavaInputFormat
Running org.apache.hadoop.mapred.pipes.TestPipeApplication
Tests run: 5, Failures: 0, Errors: 0, Skipped: 0, Time elapsed: 6.356 sec - in org.apache.hadoop.mapred.pipes.TestPipeApplication
Running org.apache.hadoop.mapred.pipes.TestPipes
Tests run: 1, Failures: 0, Errors: 0, Skipped: 1, Time elapsed: 0.051 sec - in org.apache.hadoop.mapred.pipes.TestPipes
Running org.apache.hadoop.mapred.TestSpecialCharactersInOutputPath
Tests run: 1, Failures: 0, Errors: 0, Skipped: 0, Time elapsed: 27.158 sec - in org.apache.hadoop.mapred.TestSpecialCharactersInOutputPath
Running org.apache.hadoop.mapred.TestReporter
Tests run: 3, Failures: 0, Errors: 0, Skipped: 0, Time elapsed: 14.009 sec - in org.apache.hadoop.mapred.TestReporter

Results :

Tests run: 522, Failures: 0, Errors: 0, Skipped: 11

[INFO] ------------------------------------------------------------------------
[INFO] Reactor Summary:
[INFO] 
[INFO] Apache Hadoop MapReduce Client .................... SUCCESS [  3.257 s]
[INFO] Apache Hadoop MapReduce Core ...................... SUCCESS [02:05 min]
[INFO] Apache Hadoop MapReduce Common .................... SUCCESS [ 32.139 s]
[INFO] Apache Hadoop MapReduce Shuffle ................... SUCCESS [  5.324 s]
[INFO] Apache Hadoop MapReduce App ....................... SUCCESS [09:46 min]
[INFO] Apache Hadoop MapReduce HistoryServer ............. SUCCESS [05:48 min]
[INFO] Apache Hadoop MapReduce JobClient ................. FAILURE [  01:56 h]
[INFO] Apache Hadoop MapReduce HistoryServer Plugins ..... SKIPPED
[INFO] Apache Hadoop MapReduce NativeTask ................ SKIPPED
[INFO] Apache Hadoop MapReduce Examples .................. SKIPPED
[INFO] Apache Hadoop MapReduce ........................... SKIPPED
[INFO] ------------------------------------------------------------------------
[INFO] BUILD FAILURE
[INFO] ------------------------------------------------------------------------
[INFO] Total time: 02:15 h
[INFO] Finished at: 2015-12-03T18:17:35+00:00
[INFO] Final Memory: 39M/719M
[INFO] ------------------------------------------------------------------------
[ERROR] Failed to execute goal org.apache.maven.plugins:maven-surefire-plugin:2.17:test (default-test)
on project hadoop-mapreduce-client-jobclient: There was a timeout or other error in the fork
-> [Help 1]
[ERROR] 
[ERROR] To see the full stack trace of the errors, re-run Maven with the -e switch.
[ERROR] Re-run Maven using the -X switch to enable full debug logging.
[ERROR] 
[ERROR] For more information about the errors and possible solutions, please read the following
articles:
[ERROR] [Help 1] http://cwiki.apache.org/confluence/display/MAVEN/MojoFailureException
[ERROR] 
[ERROR] After correcting the problems, you can resume the build with the command
[ERROR]   mvn <goals> -rf :hadoop-mapreduce-client-jobclient
Build step 'Execute shell' marked build as failure
[FINDBUGS] Skipping publisher since build result is FAILURE
Archiving artifacts
Recording test results
Email was triggered for: Failure - Any
Sending email for trigger: Failure - Any



###################################################################################
############################## FAILED TESTS (if any) ##############################
All tests passed
Mime
  • Unnamed multipart/mixed (inline, None, 0 bytes)
View raw message