hadoop-mapreduce-dev mailing list archives

Site index · List index
Message view « Date » · « Thread »
Top « Date » · « Thread »
From Apache Jenkins Server <jenk...@builds.apache.org>
Subject Hadoop-Mapreduce-trunk - Build # 2713 - Still Failing
Date Fri, 11 Dec 2015 11:55:45 GMT
See https://builds.apache.org/job/Hadoop-Mapreduce-trunk/2713/

###################################################################################
########################## LAST 60 LINES OF THE CONSOLE ###########################
[...truncated 32819 lines...]
Tests run: 1, Failures: 0, Errors: 0, Skipped: 0, Time elapsed: 7.958 sec - in org.apache.hadoop.mapreduce.lib.input.TestDelegatingInputFormat
Running org.apache.hadoop.mapreduce.lib.fieldsel.TestMRFieldSelection
Tests run: 1, Failures: 0, Errors: 0, Skipped: 0, Time elapsed: 3.445 sec - in org.apache.hadoop.mapreduce.lib.fieldsel.TestMRFieldSelection
Running org.apache.hadoop.mapreduce.lib.output.TestMRMultipleOutputs
Tests run: 2, Failures: 0, Errors: 0, Skipped: 0, Time elapsed: 7.452 sec - in org.apache.hadoop.mapreduce.lib.output.TestMRMultipleOutputs
Running org.apache.hadoop.mapreduce.lib.output.TestMRSequenceFileAsBinaryOutputFormat
Tests run: 3, Failures: 0, Errors: 0, Skipped: 0, Time elapsed: 2.105 sec - in org.apache.hadoop.mapreduce.lib.output.TestMRSequenceFileAsBinaryOutputFormat
Running org.apache.hadoop.mapreduce.lib.output.TestJobOutputCommitter
Tests run: 3, Failures: 0, Errors: 0, Skipped: 0, Time elapsed: 256.684 sec - in org.apache.hadoop.mapreduce.lib.output.TestJobOutputCommitter
Running org.apache.hadoop.mapreduce.lib.output.TestMRCJCFileOutputCommitter
Tests run: 4, Failures: 0, Errors: 0, Skipped: 0, Time elapsed: 1.79 sec - in org.apache.hadoop.mapreduce.lib.output.TestMRCJCFileOutputCommitter
Running org.apache.hadoop.util.TestMRCJCReflectionUtils
Tests run: 1, Failures: 0, Errors: 0, Skipped: 0, Time elapsed: 0.711 sec - in org.apache.hadoop.util.TestMRCJCReflectionUtils
Running org.apache.hadoop.util.TestMRCJCRunJar
Tests run: 1, Failures: 0, Errors: 0, Skipped: 0, Time elapsed: 0.285 sec - in org.apache.hadoop.util.TestMRCJCRunJar
Running org.apache.hadoop.io.TestSequenceFileMergeProgress
Tests run: 3, Failures: 0, Errors: 0, Skipped: 0, Time elapsed: 2.719 sec - in org.apache.hadoop.io.TestSequenceFileMergeProgress

Results :

Tests run: 522, Failures: 0, Errors: 0, Skipped: 11

[INFO] ------------------------------------------------------------------------
[INFO] Reactor Summary:
[INFO] 
[INFO] Apache Hadoop MapReduce Client .................... SUCCESS [  3.367 s]
[INFO] Apache Hadoop MapReduce Core ...................... SUCCESS [02:08 min]
[INFO] Apache Hadoop MapReduce Common .................... SUCCESS [ 32.161 s]
[INFO] Apache Hadoop MapReduce Shuffle ................... SUCCESS [  5.411 s]
[INFO] Apache Hadoop MapReduce App ....................... SUCCESS [09:54 min]
[INFO] Apache Hadoop MapReduce HistoryServer ............. SUCCESS [05:53 min]
[INFO] Apache Hadoop MapReduce JobClient ................. FAILURE [  01:56 h]
[INFO] Apache Hadoop MapReduce HistoryServer Plugins ..... SKIPPED
[INFO] Apache Hadoop MapReduce NativeTask ................ SKIPPED
[INFO] Apache Hadoop MapReduce Examples .................. SKIPPED
[INFO] Apache Hadoop MapReduce ........................... SKIPPED
[INFO] ------------------------------------------------------------------------
[INFO] BUILD FAILURE
[INFO] ------------------------------------------------------------------------
[INFO] Total time: 02:14 h
[INFO] Finished at: 2015-12-11T11:55:39+00:00
[INFO] Final Memory: 37M/763M
[INFO] ------------------------------------------------------------------------
[ERROR] Failed to execute goal org.apache.maven.plugins:maven-surefire-plugin:2.17:test (default-test)
on project hadoop-mapreduce-client-jobclient: There was a timeout or other error in the fork
-> [Help 1]
[ERROR] 
[ERROR] To see the full stack trace of the errors, re-run Maven with the -e switch.
[ERROR] Re-run Maven using the -X switch to enable full debug logging.
[ERROR] 
[ERROR] For more information about the errors and possible solutions, please read the following
articles:
[ERROR] [Help 1] http://cwiki.apache.org/confluence/display/MAVEN/MojoFailureException
[ERROR] 
[ERROR] After correcting the problems, you can resume the build with the command
[ERROR]   mvn <goals> -rf :hadoop-mapreduce-client-jobclient
Build step 'Execute shell' marked build as failure
[FINDBUGS] Skipping publisher since build result is FAILURE
Archiving artifacts
Recording test results
Email was triggered for: Failure - Any
Sending email for trigger: Failure - Any



###################################################################################
############################## FAILED TESTS (if any) ##############################
All tests passed
Mime
  • Unnamed multipart/mixed (inline, None, 0 bytes)
View raw message