hadoop-mapreduce-dev mailing list archives

Site index · List index
Message view « Date » · « Thread »
Top « Date » · « Thread »
From Apache Jenkins Server <jenk...@builds.apache.org>
Subject Hadoop-Mapreduce-trunk - Build # 2696 - Still Failing
Date Sun, 06 Dec 2015 20:00:06 GMT
See https://builds.apache.org/job/Hadoop-Mapreduce-trunk/2696/

###################################################################################
########################## LAST 60 LINES OF THE CONSOLE ###########################
[...truncated 32401 lines...]
Tests run: 25, Failures: 0, Errors: 0, Skipped: 0, Time elapsed: 28.23 sec - in org.apache.hadoop.mapreduce.v2.hs.webapp.TestHsWebServicesJobsQuery
Running org.apache.hadoop.mapreduce.v2.hs.webapp.TestHsWebServicesAttempts
Tests run: 15, Failures: 0, Errors: 0, Skipped: 0, Time elapsed: 21.686 sec - in org.apache.hadoop.mapreduce.v2.hs.webapp.TestHsWebServicesAttempts
Running org.apache.hadoop.mapreduce.v2.hs.webapp.TestHsWebServices
Tests run: 11, Failures: 0, Errors: 0, Skipped: 0, Time elapsed: 16.129 sec - in org.apache.hadoop.mapreduce.v2.hs.webapp.TestHsWebServices
Running org.apache.hadoop.mapreduce.v2.hs.webapp.TestBlocks
Tests run: 5, Failures: 0, Errors: 0, Skipped: 0, Time elapsed: 3.429 sec - in org.apache.hadoop.mapreduce.v2.hs.webapp.TestBlocks
Running org.apache.hadoop.mapreduce.v2.hs.webapp.TestHSWebApp
Tests run: 15, Failures: 0, Errors: 0, Skipped: 0, Time elapsed: 22.44 sec - in org.apache.hadoop.mapreduce.v2.hs.webapp.TestHSWebApp
Running org.apache.hadoop.mapreduce.v2.hs.TestCompletedTask
Tests run: 2, Failures: 0, Errors: 0, Skipped: 0, Time elapsed: 1.779 sec - in org.apache.hadoop.mapreduce.v2.hs.TestCompletedTask

Results :

Tests in error: 
  TestJobListCache.testAddExisting:39 ยป  test timed out after 1000 milliseconds

Tests run: 198, Failures: 0, Errors: 1, Skipped: 0

[INFO] ------------------------------------------------------------------------
[INFO] Reactor Summary:
[INFO] 
[INFO] Apache Hadoop MapReduce Client .................... SUCCESS [  7.701 s]
[INFO] Apache Hadoop MapReduce Core ...................... SUCCESS [04:10 min]
[INFO] Apache Hadoop MapReduce Common .................... SUCCESS [01:03 min]
[INFO] Apache Hadoop MapReduce Shuffle ................... SUCCESS [ 11.877 s]
[INFO] Apache Hadoop MapReduce App ....................... SUCCESS [14:53 min]
[INFO] Apache Hadoop MapReduce HistoryServer ............. FAILURE [08:37 min]
[INFO] Apache Hadoop MapReduce JobClient ................. SKIPPED
[INFO] Apache Hadoop MapReduce HistoryServer Plugins ..... SKIPPED
[INFO] Apache Hadoop MapReduce NativeTask ................ SKIPPED
[INFO] Apache Hadoop MapReduce Examples .................. SKIPPED
[INFO] Apache Hadoop MapReduce ........................... SKIPPED
[INFO] ------------------------------------------------------------------------
[INFO] BUILD FAILURE
[INFO] ------------------------------------------------------------------------
[INFO] Total time: 29:07 min
[INFO] Finished at: 2015-12-06T19:59:47+00:00
[INFO] Final Memory: 55M/1227M
[INFO] ------------------------------------------------------------------------
[ERROR] Failed to execute goal org.apache.maven.plugins:maven-surefire-plugin:2.17:test (default-test)
on project hadoop-mapreduce-client-hs: There are test failures.
[ERROR] 
[ERROR] Please refer to /home/jenkins/jenkins-slave/workspace/Hadoop-Mapreduce-trunk/hadoop-mapreduce-project/hadoop-mapreduce-client/hadoop-mapreduce-client-hs/target/surefire-reports
for the individual test results.
[ERROR] -> [Help 1]
[ERROR] 
[ERROR] To see the full stack trace of the errors, re-run Maven with the -e switch.
[ERROR] Re-run Maven using the -X switch to enable full debug logging.
[ERROR] 
[ERROR] For more information about the errors and possible solutions, please read the following
articles:
[ERROR] [Help 1] http://cwiki.apache.org/confluence/display/MAVEN/MojoFailureException
[ERROR] 
[ERROR] After correcting the problems, you can resume the build with the command
[ERROR]   mvn <goals> -rf :hadoop-mapreduce-client-hs
Build step 'Execute shell' marked build as failure
[FINDBUGS] Skipping publisher since build result is FAILURE
Archiving artifacts
Recording test results
Email was triggered for: Failure - Any
Sending email for trigger: Failure - Any



###################################################################################
############################## FAILED TESTS (if any) ##############################
1 tests failed.
FAILED:  org.apache.hadoop.mapreduce.v2.hs.TestJobListCache.testAddExisting

Error Message:
test timed out after 1000 milliseconds

Stack Trace:
java.lang.Exception: test timed out after 1000 milliseconds
	at java.lang.AbstractStringBuilder.expandCapacity(AbstractStringBuilder.java:122)
	at java.lang.AbstractStringBuilder.ensureCapacityInternal(AbstractStringBuilder.java:114)
	at java.lang.AbstractStringBuilder.append(AbstractStringBuilder.java:415)
	at java.lang.StringBuilder.append(StringBuilder.java:132)
	at sun.net.www.protocol.jar.Handler.parseURL(Handler.java:160)
	at java.net.URL.<init>(URL.java:614)
	at java.net.URL.<init>(URL.java:482)
	at sun.misc.URLClassPath$JarLoader.checkResource(URLClassPath.java:757)
	at sun.misc.URLClassPath$JarLoader.getResource(URLClassPath.java:842)
	at sun.misc.URLClassPath.getResource(URLClassPath.java:199)
	at java.net.URLClassLoader$1.run(URLClassLoader.java:358)
	at java.net.URLClassLoader$1.run(URLClassLoader.java:355)
	at java.security.AccessController.doPrivileged(Native Method)
	at java.net.URLClassLoader.findClass(URLClassLoader.java:354)
	at java.lang.ClassLoader.loadClass(ClassLoader.java:425)
	at sun.misc.Launcher$AppClassLoader.loadClass(Launcher.java:308)
	at java.lang.ClassLoader.loadClass(ClassLoader.java:358)
	at org.mockito.Answers.<clinit>(Answers.java:28)
	at org.mockito.Mockito.<clinit>(Mockito.java:685)
	at org.apache.hadoop.mapreduce.v2.hs.TestJobListCache.testAddExisting(TestJobListCache.java:39)



Mime
  • Unnamed multipart/mixed (inline, None, 0 bytes)
View raw message