hadoop-mapreduce-dev mailing list archives

Site index · List index
Message view « Date » · « Thread »
Top « Date » · « Thread »
From Apache Jenkins Server <jenk...@builds.apache.org>
Subject Hadoop-Mapreduce-trunk - Build # 2716 - Still Failing
Date Sat, 12 Dec 2015 04:24:17 GMT
See https://builds.apache.org/job/Hadoop-Mapreduce-trunk/2716/

###################################################################################
########################## LAST 60 LINES OF THE CONSOLE ###########################
[...truncated 32569 lines...]
Running org.apache.hadoop.mapred.TestLocalContainerLauncher
Tests run: 2, Failures: 0, Errors: 0, Skipped: 0, Time elapsed: 4.815 sec - in org.apache.hadoop.mapred.TestLocalContainerLauncher

Results :

Failed tests: 
  TestTaskHeartbeatHandler.testTimeout:65 
Wanted but not invoked:
eventHandler.handle(<any>);
-> at org.apache.hadoop.mapreduce.v2.app.TestTaskHeartbeatHandler.testTimeout(TestTaskHeartbeatHandler.java:65)
Actually, there were zero interactions with this mock.

  TestRuntimeEstimators.testLegacyEstimator:248->coreTestEstimator:241 We got the wrong
number of successful speculations. expected:<3> but was:<2>

Tests in error: 
  TestContainerLauncher.testSlowNM:292 ยป  test timed out after 15000 millisecond...

Tests run: 340, Failures: 2, Errors: 1, Skipped: 0

[INFO] ------------------------------------------------------------------------
[INFO] Reactor Summary:
[INFO] 
[INFO] Apache Hadoop MapReduce Client .................... SUCCESS [  9.852 s]
[INFO] Apache Hadoop MapReduce Core ...................... SUCCESS [05:29 min]
[INFO] Apache Hadoop MapReduce Common .................... SUCCESS [01:17 min]
[INFO] Apache Hadoop MapReduce Shuffle ................... SUCCESS [ 14.270 s]
[INFO] Apache Hadoop MapReduce App ....................... FAILURE [16:40 min]
[INFO] Apache Hadoop MapReduce HistoryServer ............. SKIPPED
[INFO] Apache Hadoop MapReduce JobClient ................. SKIPPED
[INFO] Apache Hadoop MapReduce HistoryServer Plugins ..... SKIPPED
[INFO] Apache Hadoop MapReduce NativeTask ................ SKIPPED
[INFO] Apache Hadoop MapReduce Examples .................. SKIPPED
[INFO] Apache Hadoop MapReduce ........................... SKIPPED
[INFO] ------------------------------------------------------------------------
[INFO] BUILD FAILURE
[INFO] ------------------------------------------------------------------------
[INFO] Total time: 23:56 min
[INFO] Finished at: 2015-12-12T04:24:09+00:00
[INFO] Final Memory: 41M/825M
[INFO] ------------------------------------------------------------------------
[ERROR] Failed to execute goal org.apache.maven.plugins:maven-surefire-plugin:2.17:test (default-test)
on project hadoop-mapreduce-client-app: There are test failures.
[ERROR] 
[ERROR] Please refer to /home/jenkins/jenkins-slave/workspace/Hadoop-Mapreduce-trunk/hadoop-mapreduce-project/hadoop-mapreduce-client/hadoop-mapreduce-client-app/target/surefire-reports
for the individual test results.
[ERROR] -> [Help 1]
[ERROR] 
[ERROR] To see the full stack trace of the errors, re-run Maven with the -e switch.
[ERROR] Re-run Maven using the -X switch to enable full debug logging.
[ERROR] 
[ERROR] For more information about the errors and possible solutions, please read the following
articles:
[ERROR] [Help 1] http://cwiki.apache.org/confluence/display/MAVEN/MojoFailureException
[ERROR] 
[ERROR] After correcting the problems, you can resume the build with the command
[ERROR]   mvn <goals> -rf :hadoop-mapreduce-client-app
Build step 'Execute shell' marked build as failure
[FINDBUGS] Skipping publisher since build result is FAILURE
Archiving artifacts
Recording test results
Email was triggered for: Failure - Any
Sending email for trigger: Failure - Any



###################################################################################
############################## FAILED TESTS (if any) ##############################
3 tests failed.
FAILED:  org.apache.hadoop.mapreduce.v2.app.TestRuntimeEstimators.testLegacyEstimator

Error Message:
We got the wrong number of successful speculations. expected:<3> but was:<2>

Stack Trace:
java.lang.AssertionError: We got the wrong number of successful speculations. expected:<3>
but was:<2>
	at org.junit.Assert.fail(Assert.java:88)
	at org.junit.Assert.failNotEquals(Assert.java:743)
	at org.junit.Assert.assertEquals(Assert.java:118)
	at org.junit.Assert.assertEquals(Assert.java:555)
	at org.apache.hadoop.mapreduce.v2.app.TestRuntimeEstimators.coreTestEstimator(TestRuntimeEstimators.java:241)
	at org.apache.hadoop.mapreduce.v2.app.TestRuntimeEstimators.testLegacyEstimator(TestRuntimeEstimators.java:248)


FAILED:  org.apache.hadoop.mapreduce.v2.app.TestTaskHeartbeatHandler.testTimeout

Error Message:

Wanted but not invoked:
eventHandler.handle(<any>);
-> at org.apache.hadoop.mapreduce.v2.app.TestTaskHeartbeatHandler.testTimeout(TestTaskHeartbeatHandler.java:65)
Actually, there were zero interactions with this mock.


Stack Trace:
org.mockito.exceptions.verification.WantedButNotInvoked: 
Wanted but not invoked:
eventHandler.handle(<any>);
-> at org.apache.hadoop.mapreduce.v2.app.TestTaskHeartbeatHandler.testTimeout(TestTaskHeartbeatHandler.java:65)
Actually, there were zero interactions with this mock.

	at org.apache.hadoop.mapreduce.v2.app.TestTaskHeartbeatHandler.testTimeout(TestTaskHeartbeatHandler.java:65)


FAILED:  org.apache.hadoop.mapreduce.v2.app.launcher.TestContainerLauncher.testSlowNM

Error Message:
test timed out after 15000 milliseconds

Stack Trace:
java.lang.Exception: test timed out after 15000 milliseconds
	at java.lang.Thread.sleep(Native Method)
	at org.apache.hadoop.mapreduce.v2.app.MRApp.waitForState(MRApp.java:408)
	at org.apache.hadoop.mapreduce.v2.app.launcher.TestContainerLauncher.testSlowNM(TestContainerLauncher.java:292)



Mime
  • Unnamed multipart/mixed (inline, None, 0 bytes)
View raw message