hadoop-mapreduce-dev mailing list archives

Site index · List index
Message view « Date » · « Thread »
Top « Date » · « Thread »
From Apache Jenkins Server <jenk...@builds.apache.org>
Subject Hadoop-Mapreduce-trunk-Java8 - Build # 738 - Still Failing
Date Wed, 02 Dec 2015 00:28:29 GMT
See https://builds.apache.org/job/Hadoop-Mapreduce-trunk-Java8/738/

###################################################################################
########################## LAST 60 LINES OF THE CONSOLE ###########################
[...truncated 10268 lines...]
Running org.apache.hadoop.mapreduce.v2.hs.TestJobHistory
Tests run: 3, Failures: 0, Errors: 0, Skipped: 0, Time elapsed: 32.459 sec - in org.apache.hadoop.mapreduce.v2.hs.TestJobHistory
Java HotSpot(TM) 64-Bit Server VM warning: ignoring option MaxPermSize=768m; support was removed
in 8.0
Running org.apache.hadoop.mapreduce.v2.hs.TestJobHistoryEvents
Tests run: 4, Failures: 0, Errors: 0, Skipped: 0, Time elapsed: 46.598 sec - in org.apache.hadoop.mapreduce.v2.hs.TestJobHistoryEvents
Java HotSpot(TM) 64-Bit Server VM warning: ignoring option MaxPermSize=768m; support was removed
in 8.0
Running org.apache.hadoop.mapreduce.v2.hs.TestHistoryFileManager
Tests run: 8, Failures: 0, Errors: 0, Skipped: 0, Time elapsed: 29.033 sec - in org.apache.hadoop.mapreduce.v2.hs.TestHistoryFileManager
Java HotSpot(TM) 64-Bit Server VM warning: ignoring option MaxPermSize=768m; support was removed
in 8.0
Running org.apache.hadoop.mapreduce.v2.hs.TestJHSDelegationTokenSecretManager
Tests run: 1, Failures: 0, Errors: 0, Skipped: 0, Time elapsed: 0.961 sec - in org.apache.hadoop.mapreduce.v2.hs.TestJHSDelegationTokenSecretManager

Results :

Tests in error: 
  TestJobListCache.testAddExisting:39 ยป  test timed out after 1000 milliseconds

Tests run: 198, Failures: 0, Errors: 1, Skipped: 0

[INFO] ------------------------------------------------------------------------
[INFO] Reactor Summary:
[INFO] 
[INFO] Apache Hadoop MapReduce Client .................... SUCCESS [  8.619 s]
[INFO] Apache Hadoop MapReduce Core ...................... SUCCESS [02:17 min]
[INFO] Apache Hadoop MapReduce Common .................... SUCCESS [ 37.380 s]
[INFO] Apache Hadoop MapReduce Shuffle ................... SUCCESS [  5.951 s]
[INFO] Apache Hadoop MapReduce App ....................... SUCCESS [14:40 min]
[INFO] Apache Hadoop MapReduce HistoryServer ............. FAILURE [08:11 min]
[INFO] Apache Hadoop MapReduce JobClient ................. SKIPPED
[INFO] Apache Hadoop MapReduce HistoryServer Plugins ..... SKIPPED
[INFO] Apache Hadoop MapReduce NativeTask ................ SKIPPED
[INFO] Apache Hadoop MapReduce Examples .................. SKIPPED
[INFO] Apache Hadoop MapReduce ........................... SKIPPED
[INFO] ------------------------------------------------------------------------
[INFO] BUILD FAILURE
[INFO] ------------------------------------------------------------------------
[INFO] Total time: 26:02 min
[INFO] Finished at: 2015-12-02T00:28:17+00:00
[INFO] Final Memory: 46M/243M
[INFO] ------------------------------------------------------------------------
[ERROR] Failed to execute goal org.apache.maven.plugins:maven-surefire-plugin:2.17:test (default-test)
on project hadoop-mapreduce-client-hs: There are test failures.
[ERROR] 
[ERROR] Please refer to /home/jenkins/jenkins-slave/workspace/Hadoop-Mapreduce-trunk-Java8/hadoop-mapreduce-project/hadoop-mapreduce-client/hadoop-mapreduce-client-hs/target/surefire-reports
for the individual test results.
[ERROR] -> [Help 1]
[ERROR] 
[ERROR] To see the full stack trace of the errors, re-run Maven with the -e switch.
[ERROR] Re-run Maven using the -X switch to enable full debug logging.
[ERROR] 
[ERROR] For more information about the errors and possible solutions, please read the following
articles:
[ERROR] [Help 1] http://cwiki.apache.org/confluence/display/MAVEN/MojoFailureException
[ERROR] 
[ERROR] After correcting the problems, you can resume the build with the command
[ERROR]   mvn <goals> -rf :hadoop-mapreduce-client-hs
Build step 'Execute shell' marked build as failure
[FINDBUGS] Skipping publisher since build result is FAILURE
Archiving artifacts
Recording test results
Email was triggered for: Failure - Any
Sending email for trigger: Failure - Any



###################################################################################
############################## FAILED TESTS (if any) ##############################
1 tests failed.
FAILED:  org.apache.hadoop.mapreduce.v2.hs.TestJobListCache.testAddExisting

Error Message:
test timed out after 1000 milliseconds

Stack Trace:
java.lang.Exception: test timed out after 1000 milliseconds
	at org.mockito.cglib.core.KeyFactory.<clinit>(KeyFactory.java:55)
	at org.mockito.cglib.proxy.Enhancer.<clinit>(Enhancer.java:70)
	at org.mockito.internal.creation.jmock.ClassImposterizer.createProxyClass(ClassImposterizer.java:68)
	at org.mockito.internal.creation.jmock.ClassImposterizer.imposterise(ClassImposterizer.java:50)
	at org.mockito.internal.util.MockUtil.createMock(MockUtil.java:54)
	at org.mockito.internal.MockitoCore.mock(MockitoCore.java:45)
	at org.mockito.Mockito.mock(Mockito.java:921)
	at org.mockito.Mockito.mock(Mockito.java:816)
	at org.apache.hadoop.mapreduce.v2.hs.TestJobListCache.testAddExisting(TestJobListCache.java:39)



Mime
  • Unnamed multipart/mixed (inline, None, 0 bytes)
View raw message