hadoop-mapreduce-dev mailing list archives

Site index · List index
Message view « Date » · « Thread »
Top « Date » · « Thread »
From Apache Jenkins Server <jenk...@builds.apache.org>
Subject Hadoop-Mapreduce-trunk-Java8 - Build # 743 - Still Failing
Date Thu, 03 Dec 2015 04:54:24 GMT
See https://builds.apache.org/job/Hadoop-Mapreduce-trunk-Java8/743/

###################################################################################
########################## LAST 60 LINES OF THE CONSOLE ###########################
[...truncated 10093 lines...]
Java HotSpot(TM) 64-Bit Server VM warning: ignoring option MaxPermSize=768m; support was removed
in 8.0
Running org.apache.hadoop.mapreduce.v2.app.TestFail
Tests run: 5, Failures: 0, Errors: 0, Skipped: 0, Time elapsed: 16.74 sec - in org.apache.hadoop.mapreduce.v2.app.TestFail
Java HotSpot(TM) 64-Bit Server VM warning: ignoring option MaxPermSize=768m; support was removed
in 8.0
Running org.apache.hadoop.mapreduce.v2.app.TestMRApp
Tests run: 13, Failures: 0, Errors: 0, Skipped: 0, Time elapsed: 22.696 sec - in org.apache.hadoop.mapreduce.v2.app.TestMRApp
Java HotSpot(TM) 64-Bit Server VM warning: ignoring option MaxPermSize=768m; support was removed
in 8.0
Running org.apache.hadoop.mapred.TestTaskAttemptFinishingMonitor
Tests run: 1, Failures: 0, Errors: 0, Skipped: 0, Time elapsed: 1.256 sec - in org.apache.hadoop.mapred.TestTaskAttemptFinishingMonitor
Java HotSpot(TM) 64-Bit Server VM warning: ignoring option MaxPermSize=768m; support was removed
in 8.0
Running org.apache.hadoop.mapred.TestTaskAttemptListenerImpl
Tests run: 6, Failures: 0, Errors: 0, Skipped: 0, Time elapsed: 1.035 sec - in org.apache.hadoop.mapred.TestTaskAttemptListenerImpl
Java HotSpot(TM) 64-Bit Server VM warning: ignoring option MaxPermSize=768m; support was removed
in 8.0
Running org.apache.hadoop.mapred.TestLocalContainerLauncher
Tests run: 2, Failures: 0, Errors: 0, Skipped: 0, Time elapsed: 1.548 sec - in org.apache.hadoop.mapred.TestLocalContainerLauncher

Results :

Tests run: 291, Failures: 0, Errors: 0, Skipped: 0

[INFO] ------------------------------------------------------------------------
[INFO] Reactor Summary:
[INFO] 
[INFO] Apache Hadoop MapReduce Client .................... SUCCESS [  2.429 s]
[INFO] Apache Hadoop MapReduce Core ...................... SUCCESS [01:40 min]
[INFO] Apache Hadoop MapReduce Common .................... SUCCESS [ 25.906 s]
[INFO] Apache Hadoop MapReduce Shuffle ................... SUCCESS [  4.193 s]
[INFO] Apache Hadoop MapReduce App ....................... FAILURE [08:57 min]
[INFO] Apache Hadoop MapReduce HistoryServer ............. SKIPPED
[INFO] Apache Hadoop MapReduce JobClient ................. SKIPPED
[INFO] Apache Hadoop MapReduce HistoryServer Plugins ..... SKIPPED
[INFO] Apache Hadoop MapReduce NativeTask ................ SKIPPED
[INFO] Apache Hadoop MapReduce Examples .................. SKIPPED
[INFO] Apache Hadoop MapReduce ........................... SKIPPED
[INFO] ------------------------------------------------------------------------
[INFO] BUILD FAILURE
[INFO] ------------------------------------------------------------------------
[INFO] Total time: 11:10 min
[INFO] Finished at: 2015-12-03T04:54:17+00:00
[INFO] Final Memory: 40M/260M
[INFO] ------------------------------------------------------------------------
[ERROR] Failed to execute goal org.apache.maven.plugins:maven-surefire-plugin:2.17:test (default-test)
on project hadoop-mapreduce-client-app: ExecutionException: java.lang.RuntimeException: The
forked VM terminated without properly saying goodbye. VM crash or System.exit called?
[ERROR] Command was /bin/sh -c cd /home/jenkins/jenkins-slave/workspace/Hadoop-Mapreduce-trunk-Java8/hadoop-mapreduce-project/hadoop-mapreduce-client/hadoop-mapreduce-client-app
&& /home/jenkins/tools/java/jdk1.8.0/jre/bin/java -Xmx2048m -XX:MaxPermSize=768m -XX:+HeapDumpOnOutOfMemoryError
-jar /home/jenkins/jenkins-slave/workspace/Hadoop-Mapreduce-trunk-Java8/hadoop-mapreduce-project/hadoop-mapreduce-client/hadoop-mapreduce-client-app/target/surefire/surefirebooter6097778098862283993.jar
/home/jenkins/jenkins-slave/workspace/Hadoop-Mapreduce-trunk-Java8/hadoop-mapreduce-project/hadoop-mapreduce-client/hadoop-mapreduce-client-app/target/surefire/surefire108066065318640460tmp
/home/jenkins/jenkins-slave/workspace/Hadoop-Mapreduce-trunk-Java8/hadoop-mapreduce-project/hadoop-mapreduce-client/hadoop-mapreduce-client-app/target/surefire/surefire_82802930171256542328tmp
[ERROR] -> [Help 1]
[ERROR] 
[ERROR] To see the full stack trace of the errors, re-run Maven with the -e switch.
[ERROR] Re-run Maven using the -X switch to enable full debug logging.
[ERROR] 
[ERROR] For more information about the errors and possible solutions, please read the following
articles:
[ERROR] [Help 1] http://cwiki.apache.org/confluence/display/MAVEN/MojoFailureException
[ERROR] 
[ERROR] After correcting the problems, you can resume the build with the command
[ERROR]   mvn <goals> -rf :hadoop-mapreduce-client-app
Build step 'Execute shell' marked build as failure
[FINDBUGS] Skipping publisher since build result is FAILURE
Archiving artifacts
Recording test results
Email was triggered for: Failure - Any
Sending email for trigger: Failure - Any



###################################################################################
############################## FAILED TESTS (if any) ##############################
All tests passed
Mime
  • Unnamed multipart/mixed (inline, None, 0 bytes)
View raw message