hadoop-mapreduce-dev mailing list archives

Site index · List index
Message view « Date » · « Thread »
Top « Date » · « Thread »
From Apache Jenkins Server <jenk...@builds.apache.org>
Subject Hadoop-Mapreduce-trunk-Java8 - Build # 782 - Still Failing
Date Tue, 15 Dec 2015 01:17:27 GMT
See https://builds.apache.org/job/Hadoop-Mapreduce-trunk-Java8/782/

###################################################################################
########################## LAST 60 LINES OF THE CONSOLE ###########################
[...truncated 11091 lines...]

Failed tests: 
  TestNetworkedJob.testNetworkedJob:174 expected:<[[Tue Dec 15 00:50:35 +0000 2015] Scheduler
has assigned a container for AM, waiting for AM container to be launched]> but was:<[]>

Tests in error: 
  TestUberAM.testFailingMapper:110->TestMRJobs.runFailingMapperJob:627 » NoClassDefFound
  TestUberAM.testSleepJob:57->TestMRJobs.testSleepJob:193->TestMRJobs.testSleepJobInternal:231
» NoClassDefFound
  TestUberAM.testSleepJobWithMultipleReducers:64->TestMRJobs.testSleepJob:193->TestMRJobs.testSleepJobInternal:231
» NoClassDefFound
  TestUberAM.testRandomWriter:84->TestMRJobs.testRandomWriter:515 » NoClassDefFound
  TestUberAM>TestMRJobs.testDistributedCache:979->TestMRJobs._testDistributedCache:966
» NoClassDefFound
  TestUberAM>TestMRJobs.testSleepJobWithRemoteJar:198->TestMRJobs.testSleepJobInternal:231
» NoClassDefFound
  TestUberAM>TestMRJobs.testConfVerificationWithJobClient:326->TestMRJobs.testConfVerification:355
» NoClassDefFound
  TestUberAM>TestMRJobs.testConfVerificationWithClassloaderCustomClasses:316->TestMRJobs.testConfVerification:355
» NoClassDefFound
  TestUberAM>TestMRJobs.testConfVerificationWithOutClassloader:321->TestMRJobs.testConfVerification:355
» NoClassDefFound
  TestUberAM>TestMRJobs.testContainerRollingLog:715 » NoClassDefFound org/apache...
  TestUberAM>TestMRJobs.testJobWithChangePriority:270 » NoClassDefFound org/apac...
  TestUberAM>TestMRJobs.testConfVerificationWithClassloader:310->TestMRJobs.testConfVerification:355
» NoClassDefFound

Tests run: 525, Failures: 1, Errors: 12, Skipped: 11

[INFO] ------------------------------------------------------------------------
[INFO] Reactor Summary:
[INFO] 
[INFO] Apache Hadoop MapReduce Client .................... SUCCESS [  2.596 s]
[INFO] Apache Hadoop MapReduce Core ...................... SUCCESS [01:48 min]
[INFO] Apache Hadoop MapReduce Common .................... SUCCESS [ 28.812 s]
[INFO] Apache Hadoop MapReduce Shuffle ................... SUCCESS [  4.970 s]
[INFO] Apache Hadoop MapReduce App ....................... SUCCESS [11:20 min]
[INFO] Apache Hadoop MapReduce HistoryServer ............. SUCCESS [06:25 min]
[INFO] Apache Hadoop MapReduce JobClient ................. FAILURE [  01:34 h]
[INFO] Apache Hadoop MapReduce HistoryServer Plugins ..... SKIPPED
[INFO] Apache Hadoop MapReduce NativeTask ................ SKIPPED
[INFO] Apache Hadoop MapReduce Examples .................. SKIPPED
[INFO] Apache Hadoop MapReduce ........................... SKIPPED
[INFO] ------------------------------------------------------------------------
[INFO] BUILD FAILURE
[INFO] ------------------------------------------------------------------------
[INFO] Total time: 01:54 h
[INFO] Finished at: 2015-12-15T01:17:12+00:00
[INFO] Final Memory: 35M/173M
[INFO] ------------------------------------------------------------------------
[ERROR] Failed to execute goal org.apache.maven.plugins:maven-surefire-plugin:2.17:test (default-test)
on project hadoop-mapreduce-client-jobclient: ExecutionException: java.lang.RuntimeException:
The forked VM terminated without properly saying goodbye. VM crash or System.exit called?
[ERROR] Command was /bin/sh -c cd /home/jenkins/jenkins-slave/workspace/Hadoop-Mapreduce-trunk-Java8/hadoop-mapreduce-project/hadoop-mapreduce-client/hadoop-mapreduce-client-jobclient
&& /home/jenkins/tools/java/jdk1.8.0/jre/bin/java -Xmx2048m -XX:MaxPermSize=768m -XX:+HeapDumpOnOutOfMemoryError
-jar /home/jenkins/jenkins-slave/workspace/Hadoop-Mapreduce-trunk-Java8/hadoop-mapreduce-project/hadoop-mapreduce-client/hadoop-mapreduce-client-jobclient/target/surefire/surefirebooter2348024350532413433.jar
/home/jenkins/jenkins-slave/workspace/Hadoop-Mapreduce-trunk-Java8/hadoop-mapreduce-project/hadoop-mapreduce-client/hadoop-mapreduce-client-jobclient/target/surefire/surefire168897306314393686tmp
/home/jenkins/jenkins-slave/workspace/Hadoop-Mapreduce-trunk-Java8/hadoop-mapreduce-project/hadoop-mapreduce-client/hadoop-mapreduce-client-jobclient/target/surefire/surefire_1997059575780953454553tmp
[ERROR] -> [Help 1]
[ERROR] 
[ERROR] To see the full stack trace of the errors, re-run Maven with the -e switch.
[ERROR] Re-run Maven using the -X switch to enable full debug logging.
[ERROR] 
[ERROR] For more information about the errors and possible solutions, please read the following
articles:
[ERROR] [Help 1] http://cwiki.apache.org/confluence/display/MAVEN/MojoFailureException
[ERROR] 
[ERROR] After correcting the problems, you can resume the build with the command
[ERROR]   mvn <goals> -rf :hadoop-mapreduce-client-jobclient
Build step 'Execute shell' marked build as failure
[FINDBUGS] Skipping publisher since build result is FAILURE
Archiving artifacts
Recording test results
Email was triggered for: Failure - Any
Sending email for trigger: Failure - Any



###################################################################################
############################## FAILED TESTS (if any) ##############################
13 tests failed.
FAILED:  org.apache.hadoop.mapred.TestNetworkedJob.testNetworkedJob

Error Message:
expected:<[[Tue Dec 15 00:50:35 +0000 2015] Scheduler has assigned a container for AM,
waiting for AM container to be launched]> but was:<[]>

Stack Trace:
org.junit.ComparisonFailure: expected:<[[Tue Dec 15 00:50:35 +0000 2015] Scheduler has
assigned a container for AM, waiting for AM container to be launched]> but was:<[]>
	at org.junit.Assert.assertEquals(Assert.java:115)
	at org.junit.Assert.assertEquals(Assert.java:144)
	at org.apache.hadoop.mapred.TestNetworkedJob.testNetworkedJob(TestNetworkedJob.java:174)


FAILED:  org.apache.hadoop.mapreduce.v2.TestUberAM.testFailingMapper

Error Message:
org/apache/hadoop/yarn/client/api/YarnClient

Stack Trace:
java.lang.NoClassDefFoundError: org/apache/hadoop/yarn/client/api/YarnClient
	at java.net.URLClassLoader$1.run(URLClassLoader.java:372)
	at java.net.URLClassLoader$1.run(URLClassLoader.java:361)
	at java.security.AccessController.doPrivileged(Native Method)
	at java.net.URLClassLoader.findClass(URLClassLoader.java:360)
	at java.lang.ClassLoader.loadClass(ClassLoader.java:424)
	at sun.misc.Launcher$AppClassLoader.loadClass(Launcher.java:308)
	at java.lang.ClassLoader.loadClass(ClassLoader.java:357)
	at java.lang.ClassLoader.defineClass1(Native Method)
	at java.lang.ClassLoader.defineClass(ClassLoader.java:760)
	at java.security.SecureClassLoader.defineClass(SecureClassLoader.java:142)
	at java.net.URLClassLoader.defineClass(URLClassLoader.java:455)
	at java.net.URLClassLoader.access$100(URLClassLoader.java:73)
	at java.net.URLClassLoader$1.run(URLClassLoader.java:367)
	at java.net.URLClassLoader$1.run(URLClassLoader.java:361)
	at java.security.AccessController.doPrivileged(Native Method)
	at java.net.URLClassLoader.findClass(URLClassLoader.java:360)
	at java.lang.ClassLoader.loadClass(ClassLoader.java:424)
	at sun.misc.Launcher$AppClassLoader.loadClass(Launcher.java:308)
	at java.lang.ClassLoader.loadClass(ClassLoader.java:357)
	at org.apache.hadoop.mapred.YARNRunner.<init>(YARNRunner.java:122)
	at org.apache.hadoop.mapred.YarnClientProtocolProvider.create(YarnClientProtocolProvider.java:34)
	at org.apache.hadoop.mapreduce.Cluster.initialize(Cluster.java:95)
	at org.apache.hadoop.mapreduce.Cluster.<init>(Cluster.java:82)
	at org.apache.hadoop.mapreduce.Cluster.<init>(Cluster.java:75)
	at org.apache.hadoop.mapreduce.Job$10.run(Job.java:1311)
	at org.apache.hadoop.mapreduce.Job$10.run(Job.java:1307)
	at java.security.AccessController.doPrivileged(Native Method)
	at javax.security.auth.Subject.doAs(Subject.java:422)
	at org.apache.hadoop.security.UserGroupInformation.doAs(UserGroupInformation.java:1669)
	at org.apache.hadoop.mapreduce.Job.connect(Job.java:1307)
	at org.apache.hadoop.mapreduce.Job.submit(Job.java:1335)
	at org.apache.hadoop.mapreduce.v2.TestMRJobs.runFailingMapperJob(TestMRJobs.java:627)
	at org.apache.hadoop.mapreduce.v2.TestUberAM.testFailingMapper(TestUberAM.java:110)


FAILED:  org.apache.hadoop.mapreduce.v2.TestUberAM.testSleepJob

Error Message:
org/apache/hadoop/mapred/ResourceMgrDelegate

Stack Trace:
java.lang.NoClassDefFoundError: org/apache/hadoop/mapred/ResourceMgrDelegate
	at org.apache.hadoop.mapred.YARNRunner.<init>(YARNRunner.java:122)
	at org.apache.hadoop.mapred.YarnClientProtocolProvider.create(YarnClientProtocolProvider.java:34)
	at org.apache.hadoop.mapreduce.Cluster.initialize(Cluster.java:95)
	at org.apache.hadoop.mapreduce.Cluster.<init>(Cluster.java:82)
	at org.apache.hadoop.mapreduce.Cluster.<init>(Cluster.java:75)
	at org.apache.hadoop.mapreduce.Job$10.run(Job.java:1311)
	at org.apache.hadoop.mapreduce.Job$10.run(Job.java:1307)
	at java.security.AccessController.doPrivileged(Native Method)
	at javax.security.auth.Subject.doAs(Subject.java:422)
	at org.apache.hadoop.security.UserGroupInformation.doAs(UserGroupInformation.java:1669)
	at org.apache.hadoop.mapreduce.Job.connect(Job.java:1307)
	at org.apache.hadoop.mapreduce.Job.submit(Job.java:1335)
	at org.apache.hadoop.mapreduce.v2.TestMRJobs.testSleepJobInternal(TestMRJobs.java:231)
	at org.apache.hadoop.mapreduce.v2.TestMRJobs.testSleepJob(TestMRJobs.java:193)
	at org.apache.hadoop.mapreduce.v2.TestUberAM.testSleepJob(TestUberAM.java:57)


FAILED:  org.apache.hadoop.mapreduce.v2.TestUberAM.testSleepJobWithMultipleReducers

Error Message:
org/apache/hadoop/mapred/ResourceMgrDelegate

Stack Trace:
java.lang.NoClassDefFoundError: org/apache/hadoop/mapred/ResourceMgrDelegate
	at org.apache.hadoop.mapred.YARNRunner.<init>(YARNRunner.java:122)
	at org.apache.hadoop.mapred.YarnClientProtocolProvider.create(YarnClientProtocolProvider.java:34)
	at org.apache.hadoop.mapreduce.Cluster.initialize(Cluster.java:95)
	at org.apache.hadoop.mapreduce.Cluster.<init>(Cluster.java:82)
	at org.apache.hadoop.mapreduce.Cluster.<init>(Cluster.java:75)
	at org.apache.hadoop.mapreduce.Job$10.run(Job.java:1311)
	at org.apache.hadoop.mapreduce.Job$10.run(Job.java:1307)
	at java.security.AccessController.doPrivileged(Native Method)
	at javax.security.auth.Subject.doAs(Subject.java:422)
	at org.apache.hadoop.security.UserGroupInformation.doAs(UserGroupInformation.java:1669)
	at org.apache.hadoop.mapreduce.Job.connect(Job.java:1307)
	at org.apache.hadoop.mapreduce.Job.submit(Job.java:1335)
	at org.apache.hadoop.mapreduce.v2.TestMRJobs.testSleepJobInternal(TestMRJobs.java:231)
	at org.apache.hadoop.mapreduce.v2.TestMRJobs.testSleepJob(TestMRJobs.java:193)
	at org.apache.hadoop.mapreduce.v2.TestUberAM.testSleepJobWithMultipleReducers(TestUberAM.java:64)


FAILED:  org.apache.hadoop.mapreduce.v2.TestUberAM.testRandomWriter

Error Message:
org/apache/hadoop/mapred/ResourceMgrDelegate

Stack Trace:
java.lang.NoClassDefFoundError: org/apache/hadoop/mapred/ResourceMgrDelegate
	at org.apache.hadoop.mapred.YARNRunner.<init>(YARNRunner.java:122)
	at org.apache.hadoop.mapred.YarnClientProtocolProvider.create(YarnClientProtocolProvider.java:34)
	at org.apache.hadoop.mapreduce.Cluster.initialize(Cluster.java:95)
	at org.apache.hadoop.mapreduce.Cluster.<init>(Cluster.java:82)
	at org.apache.hadoop.mapreduce.Cluster.<init>(Cluster.java:75)
	at org.apache.hadoop.mapreduce.Job$10.run(Job.java:1311)
	at org.apache.hadoop.mapreduce.Job$10.run(Job.java:1307)
	at java.security.AccessController.doPrivileged(Native Method)
	at javax.security.auth.Subject.doAs(Subject.java:422)
	at org.apache.hadoop.security.UserGroupInformation.doAs(UserGroupInformation.java:1669)
	at org.apache.hadoop.mapreduce.Job.connect(Job.java:1307)
	at org.apache.hadoop.mapreduce.Job.submit(Job.java:1335)
	at org.apache.hadoop.mapreduce.v2.TestMRJobs.testRandomWriter(TestMRJobs.java:515)
	at org.apache.hadoop.mapreduce.v2.TestUberAM.testRandomWriter(TestUberAM.java:84)


FAILED:  org.apache.hadoop.mapreduce.v2.TestUberAM.testDistributedCache

Error Message:
org/apache/hadoop/mapred/ResourceMgrDelegate

Stack Trace:
java.lang.NoClassDefFoundError: org/apache/hadoop/mapred/ResourceMgrDelegate
	at org.apache.hadoop.mapred.YARNRunner.<init>(YARNRunner.java:122)
	at org.apache.hadoop.mapred.YarnClientProtocolProvider.create(YarnClientProtocolProvider.java:34)
	at org.apache.hadoop.mapreduce.Cluster.initialize(Cluster.java:95)
	at org.apache.hadoop.mapreduce.Cluster.<init>(Cluster.java:82)
	at org.apache.hadoop.mapreduce.Cluster.<init>(Cluster.java:75)
	at org.apache.hadoop.mapreduce.Job$10.run(Job.java:1311)
	at org.apache.hadoop.mapreduce.Job$10.run(Job.java:1307)
	at java.security.AccessController.doPrivileged(Native Method)
	at javax.security.auth.Subject.doAs(Subject.java:422)
	at org.apache.hadoop.security.UserGroupInformation.doAs(UserGroupInformation.java:1669)
	at org.apache.hadoop.mapreduce.Job.connect(Job.java:1307)
	at org.apache.hadoop.mapreduce.Job.submit(Job.java:1335)
	at org.apache.hadoop.mapreduce.v2.TestMRJobs._testDistributedCache(TestMRJobs.java:966)
	at org.apache.hadoop.mapreduce.v2.TestMRJobs.testDistributedCache(TestMRJobs.java:979)
	at sun.reflect.NativeMethodAccessorImpl.invoke0(Native Method)
	at sun.reflect.NativeMethodAccessorImpl.invoke(NativeMethodAccessorImpl.java:62)
	at sun.reflect.DelegatingMethodAccessorImpl.invoke(DelegatingMethodAccessorImpl.java:43)
	at java.lang.reflect.Method.invoke(Method.java:483)
	at org.junit.runners.model.FrameworkMethod$1.runReflectiveCall(FrameworkMethod.java:47)
	at org.junit.internal.runners.model.ReflectiveCallable.run(ReflectiveCallable.java:12)
	at org.junit.runners.model.FrameworkMethod.invokeExplosively(FrameworkMethod.java:44)
	at org.junit.internal.runners.statements.InvokeMethod.evaluate(InvokeMethod.java:17)
	at org.junit.internal.runners.statements.FailOnTimeout$StatementThread.run(FailOnTimeout.java:74)


FAILED:  org.apache.hadoop.mapreduce.v2.TestUberAM.testSleepJobWithRemoteJar

Error Message:
org/apache/hadoop/mapred/ResourceMgrDelegate

Stack Trace:
java.lang.NoClassDefFoundError: org/apache/hadoop/mapred/ResourceMgrDelegate
	at org.apache.hadoop.mapred.YARNRunner.<init>(YARNRunner.java:122)
	at org.apache.hadoop.mapred.YarnClientProtocolProvider.create(YarnClientProtocolProvider.java:34)
	at org.apache.hadoop.mapreduce.Cluster.initialize(Cluster.java:95)
	at org.apache.hadoop.mapreduce.Cluster.<init>(Cluster.java:82)
	at org.apache.hadoop.mapreduce.Cluster.<init>(Cluster.java:75)
	at org.apache.hadoop.mapreduce.Job$10.run(Job.java:1311)
	at org.apache.hadoop.mapreduce.Job$10.run(Job.java:1307)
	at java.security.AccessController.doPrivileged(Native Method)
	at javax.security.auth.Subject.doAs(Subject.java:422)
	at org.apache.hadoop.security.UserGroupInformation.doAs(UserGroupInformation.java:1669)
	at org.apache.hadoop.mapreduce.Job.connect(Job.java:1307)
	at org.apache.hadoop.mapreduce.Job.submit(Job.java:1335)
	at org.apache.hadoop.mapreduce.v2.TestMRJobs.testSleepJobInternal(TestMRJobs.java:231)
	at org.apache.hadoop.mapreduce.v2.TestMRJobs.testSleepJobWithRemoteJar(TestMRJobs.java:198)
	at sun.reflect.NativeMethodAccessorImpl.invoke0(Native Method)
	at sun.reflect.NativeMethodAccessorImpl.invoke(NativeMethodAccessorImpl.java:62)
	at sun.reflect.DelegatingMethodAccessorImpl.invoke(DelegatingMethodAccessorImpl.java:43)
	at java.lang.reflect.Method.invoke(Method.java:483)
	at org.junit.runners.model.FrameworkMethod$1.runReflectiveCall(FrameworkMethod.java:47)
	at org.junit.internal.runners.model.ReflectiveCallable.run(ReflectiveCallable.java:12)
	at org.junit.runners.model.FrameworkMethod.invokeExplosively(FrameworkMethod.java:44)
	at org.junit.internal.runners.statements.InvokeMethod.evaluate(InvokeMethod.java:17)
	at org.junit.internal.runners.statements.FailOnTimeout$StatementThread.run(FailOnTimeout.java:74)


FAILED:  org.apache.hadoop.mapreduce.v2.TestUberAM.testConfVerificationWithJobClient

Error Message:
org/apache/hadoop/mapred/ResourceMgrDelegate

Stack Trace:
java.lang.NoClassDefFoundError: org/apache/hadoop/mapred/ResourceMgrDelegate
	at org.apache.hadoop.mapred.YARNRunner.<init>(YARNRunner.java:122)
	at org.apache.hadoop.mapred.YarnClientProtocolProvider.create(YarnClientProtocolProvider.java:34)
	at org.apache.hadoop.mapreduce.Cluster.initialize(Cluster.java:95)
	at org.apache.hadoop.mapreduce.Cluster.<init>(Cluster.java:82)
	at org.apache.hadoop.mapreduce.Cluster.<init>(Cluster.java:75)
	at org.apache.hadoop.mapred.JobClient.init(JobClient.java:475)
	at org.apache.hadoop.mapred.JobClient.<init>(JobClient.java:465)
	at org.apache.hadoop.mapreduce.v2.TestMRJobs.testConfVerification(TestMRJobs.java:355)
	at org.apache.hadoop.mapreduce.v2.TestMRJobs.testConfVerificationWithJobClient(TestMRJobs.java:326)
	at sun.reflect.NativeMethodAccessorImpl.invoke0(Native Method)
	at sun.reflect.NativeMethodAccessorImpl.invoke(NativeMethodAccessorImpl.java:62)
	at sun.reflect.DelegatingMethodAccessorImpl.invoke(DelegatingMethodAccessorImpl.java:43)
	at java.lang.reflect.Method.invoke(Method.java:483)
	at org.junit.runners.model.FrameworkMethod$1.runReflectiveCall(FrameworkMethod.java:47)
	at org.junit.internal.runners.model.ReflectiveCallable.run(ReflectiveCallable.java:12)
	at org.junit.runners.model.FrameworkMethod.invokeExplosively(FrameworkMethod.java:44)
	at org.junit.internal.runners.statements.InvokeMethod.evaluate(InvokeMethod.java:17)
	at org.junit.internal.runners.statements.FailOnTimeout$StatementThread.run(FailOnTimeout.java:74)


FAILED:  org.apache.hadoop.mapreduce.v2.TestUberAM.testConfVerificationWithClassloaderCustomClasses

Error Message:
org/apache/hadoop/mapred/ResourceMgrDelegate

Stack Trace:
java.lang.NoClassDefFoundError: org/apache/hadoop/mapred/ResourceMgrDelegate
	at org.apache.hadoop.mapred.YARNRunner.<init>(YARNRunner.java:122)
	at org.apache.hadoop.mapred.YarnClientProtocolProvider.create(YarnClientProtocolProvider.java:34)
	at org.apache.hadoop.mapreduce.Cluster.initialize(Cluster.java:95)
	at org.apache.hadoop.mapreduce.Cluster.<init>(Cluster.java:82)
	at org.apache.hadoop.mapreduce.Cluster.<init>(Cluster.java:75)
	at org.apache.hadoop.mapred.JobClient.init(JobClient.java:475)
	at org.apache.hadoop.mapred.JobClient.<init>(JobClient.java:465)
	at org.apache.hadoop.mapreduce.v2.TestMRJobs.testConfVerification(TestMRJobs.java:355)
	at org.apache.hadoop.mapreduce.v2.TestMRJobs.testConfVerificationWithClassloaderCustomClasses(TestMRJobs.java:316)
	at sun.reflect.NativeMethodAccessorImpl.invoke0(Native Method)
	at sun.reflect.NativeMethodAccessorImpl.invoke(NativeMethodAccessorImpl.java:62)
	at sun.reflect.DelegatingMethodAccessorImpl.invoke(DelegatingMethodAccessorImpl.java:43)
	at java.lang.reflect.Method.invoke(Method.java:483)
	at org.junit.runners.model.FrameworkMethod$1.runReflectiveCall(FrameworkMethod.java:47)
	at org.junit.internal.runners.model.ReflectiveCallable.run(ReflectiveCallable.java:12)
	at org.junit.runners.model.FrameworkMethod.invokeExplosively(FrameworkMethod.java:44)
	at org.junit.internal.runners.statements.InvokeMethod.evaluate(InvokeMethod.java:17)
	at org.junit.internal.runners.statements.FailOnTimeout$StatementThread.run(FailOnTimeout.java:74)


FAILED:  org.apache.hadoop.mapreduce.v2.TestUberAM.testConfVerificationWithOutClassloader

Error Message:
org/apache/hadoop/mapred/ResourceMgrDelegate

Stack Trace:
java.lang.NoClassDefFoundError: org/apache/hadoop/mapred/ResourceMgrDelegate
	at org.apache.hadoop.mapred.YARNRunner.<init>(YARNRunner.java:122)
	at org.apache.hadoop.mapred.YarnClientProtocolProvider.create(YarnClientProtocolProvider.java:34)
	at org.apache.hadoop.mapreduce.Cluster.initialize(Cluster.java:95)
	at org.apache.hadoop.mapreduce.Cluster.<init>(Cluster.java:82)
	at org.apache.hadoop.mapreduce.Cluster.<init>(Cluster.java:75)
	at org.apache.hadoop.mapred.JobClient.init(JobClient.java:475)
	at org.apache.hadoop.mapred.JobClient.<init>(JobClient.java:465)
	at org.apache.hadoop.mapreduce.v2.TestMRJobs.testConfVerification(TestMRJobs.java:355)
	at org.apache.hadoop.mapreduce.v2.TestMRJobs.testConfVerificationWithOutClassloader(TestMRJobs.java:321)
	at sun.reflect.NativeMethodAccessorImpl.invoke0(Native Method)
	at sun.reflect.NativeMethodAccessorImpl.invoke(NativeMethodAccessorImpl.java:62)
	at sun.reflect.DelegatingMethodAccessorImpl.invoke(DelegatingMethodAccessorImpl.java:43)
	at java.lang.reflect.Method.invoke(Method.java:483)
	at org.junit.runners.model.FrameworkMethod$1.runReflectiveCall(FrameworkMethod.java:47)
	at org.junit.internal.runners.model.ReflectiveCallable.run(ReflectiveCallable.java:12)
	at org.junit.runners.model.FrameworkMethod.invokeExplosively(FrameworkMethod.java:44)
	at org.junit.internal.runners.statements.InvokeMethod.evaluate(InvokeMethod.java:17)
	at org.junit.internal.runners.statements.FailOnTimeout$StatementThread.run(FailOnTimeout.java:74)


FAILED:  org.apache.hadoop.mapreduce.v2.TestUberAM.testContainerRollingLog

Error Message:
org/apache/hadoop/mapred/ResourceMgrDelegate

Stack Trace:
java.lang.NoClassDefFoundError: org/apache/hadoop/mapred/ResourceMgrDelegate
	at org.apache.hadoop.mapred.YARNRunner.<init>(YARNRunner.java:122)
	at org.apache.hadoop.mapred.YarnClientProtocolProvider.create(YarnClientProtocolProvider.java:34)
	at org.apache.hadoop.mapreduce.Cluster.initialize(Cluster.java:95)
	at org.apache.hadoop.mapreduce.Cluster.<init>(Cluster.java:82)
	at org.apache.hadoop.mapreduce.Cluster.<init>(Cluster.java:75)
	at org.apache.hadoop.mapreduce.Job$10.run(Job.java:1311)
	at org.apache.hadoop.mapreduce.Job$10.run(Job.java:1307)
	at java.security.AccessController.doPrivileged(Native Method)
	at javax.security.auth.Subject.doAs(Subject.java:422)
	at org.apache.hadoop.security.UserGroupInformation.doAs(UserGroupInformation.java:1669)
	at org.apache.hadoop.mapreduce.Job.connect(Job.java:1307)
	at org.apache.hadoop.mapreduce.Job.submit(Job.java:1335)
	at org.apache.hadoop.mapreduce.Job.waitForCompletion(Job.java:1359)
	at org.apache.hadoop.mapreduce.v2.TestMRJobs.testContainerRollingLog(TestMRJobs.java:715)
	at sun.reflect.NativeMethodAccessorImpl.invoke0(Native Method)
	at sun.reflect.NativeMethodAccessorImpl.invoke(NativeMethodAccessorImpl.java:62)
	at sun.reflect.DelegatingMethodAccessorImpl.invoke(DelegatingMethodAccessorImpl.java:43)
	at java.lang.reflect.Method.invoke(Method.java:483)
	at org.junit.runners.model.FrameworkMethod$1.runReflectiveCall(FrameworkMethod.java:47)
	at org.junit.internal.runners.model.ReflectiveCallable.run(ReflectiveCallable.java:12)
	at org.junit.runners.model.FrameworkMethod.invokeExplosively(FrameworkMethod.java:44)
	at org.junit.internal.runners.statements.InvokeMethod.evaluate(InvokeMethod.java:17)
	at org.junit.internal.runners.statements.FailOnTimeout$StatementThread.run(FailOnTimeout.java:74)


FAILED:  org.apache.hadoop.mapreduce.v2.TestUberAM.testJobWithChangePriority

Error Message:
org/apache/hadoop/mapred/ResourceMgrDelegate

Stack Trace:
java.lang.NoClassDefFoundError: org/apache/hadoop/mapred/ResourceMgrDelegate
	at org.apache.hadoop.mapred.YARNRunner.<init>(YARNRunner.java:122)
	at org.apache.hadoop.mapred.YarnClientProtocolProvider.create(YarnClientProtocolProvider.java:34)
	at org.apache.hadoop.mapreduce.Cluster.initialize(Cluster.java:95)
	at org.apache.hadoop.mapreduce.Cluster.<init>(Cluster.java:82)
	at org.apache.hadoop.mapreduce.Cluster.<init>(Cluster.java:75)
	at org.apache.hadoop.mapreduce.Job$10.run(Job.java:1311)
	at org.apache.hadoop.mapreduce.Job$10.run(Job.java:1307)
	at java.security.AccessController.doPrivileged(Native Method)
	at javax.security.auth.Subject.doAs(Subject.java:422)
	at org.apache.hadoop.security.UserGroupInformation.doAs(UserGroupInformation.java:1669)
	at org.apache.hadoop.mapreduce.Job.connect(Job.java:1307)
	at org.apache.hadoop.mapreduce.Job.submit(Job.java:1335)
	at org.apache.hadoop.mapreduce.v2.TestMRJobs.testJobWithChangePriority(TestMRJobs.java:270)
	at sun.reflect.NativeMethodAccessorImpl.invoke0(Native Method)
	at sun.reflect.NativeMethodAccessorImpl.invoke(NativeMethodAccessorImpl.java:62)
	at sun.reflect.DelegatingMethodAccessorImpl.invoke(DelegatingMethodAccessorImpl.java:43)
	at java.lang.reflect.Method.invoke(Method.java:483)
	at org.junit.runners.model.FrameworkMethod$1.runReflectiveCall(FrameworkMethod.java:47)
	at org.junit.internal.runners.model.ReflectiveCallable.run(ReflectiveCallable.java:12)
	at org.junit.runners.model.FrameworkMethod.invokeExplosively(FrameworkMethod.java:44)
	at org.junit.internal.runners.statements.InvokeMethod.evaluate(InvokeMethod.java:17)
	at org.junit.internal.runners.statements.FailOnTimeout$StatementThread.run(FailOnTimeout.java:74)


FAILED:  org.apache.hadoop.mapreduce.v2.TestUberAM.testConfVerificationWithClassloader

Error Message:
org/apache/hadoop/mapred/ResourceMgrDelegate

Stack Trace:
java.lang.NoClassDefFoundError: org/apache/hadoop/mapred/ResourceMgrDelegate
	at org.apache.hadoop.mapred.YARNRunner.<init>(YARNRunner.java:122)
	at org.apache.hadoop.mapred.YarnClientProtocolProvider.create(YarnClientProtocolProvider.java:34)
	at org.apache.hadoop.mapreduce.Cluster.initialize(Cluster.java:95)
	at org.apache.hadoop.mapreduce.Cluster.<init>(Cluster.java:82)
	at org.apache.hadoop.mapreduce.Cluster.<init>(Cluster.java:75)
	at org.apache.hadoop.mapred.JobClient.init(JobClient.java:475)
	at org.apache.hadoop.mapred.JobClient.<init>(JobClient.java:465)
	at org.apache.hadoop.mapreduce.v2.TestMRJobs.testConfVerification(TestMRJobs.java:355)
	at org.apache.hadoop.mapreduce.v2.TestMRJobs.testConfVerificationWithClassloader(TestMRJobs.java:310)
	at sun.reflect.NativeMethodAccessorImpl.invoke0(Native Method)
	at sun.reflect.NativeMethodAccessorImpl.invoke(NativeMethodAccessorImpl.java:62)
	at sun.reflect.DelegatingMethodAccessorImpl.invoke(DelegatingMethodAccessorImpl.java:43)
	at java.lang.reflect.Method.invoke(Method.java:483)
	at org.junit.runners.model.FrameworkMethod$1.runReflectiveCall(FrameworkMethod.java:47)
	at org.junit.internal.runners.model.ReflectiveCallable.run(ReflectiveCallable.java:12)
	at org.junit.runners.model.FrameworkMethod.invokeExplosively(FrameworkMethod.java:44)
	at org.junit.internal.runners.statements.InvokeMethod.evaluate(InvokeMethod.java:17)
	at org.junit.internal.runners.statements.FailOnTimeout$StatementThread.run(FailOnTimeout.java:74)



Mime
  • Unnamed multipart/mixed (inline, None, 0 bytes)
View raw message