hadoop-mapreduce-dev mailing list archives

Site index · List index
Message view « Date » · « Thread »
Top « Date » · « Thread »
From Apache Jenkins Server <jenk...@builds.apache.org>
Subject Hadoop-Mapreduce-trunk-Java8 - Build # 878 - Still Failing
Date Tue, 12 Jan 2016 03:58:36 GMT
See https://builds.apache.org/job/Hadoop-Mapreduce-trunk-Java8/878/

###################################################################################
########################## LAST 60 LINES OF THE CONSOLE ###########################
[...truncated 10879 lines...]
Running org.apache.hadoop.mapred.TestMiniMRDFSCaching
Tests run: 1, Failures: 0, Errors: 0, Skipped: 1, Time elapsed: 0.033 sec - in org.apache.hadoop.mapred.TestMiniMRDFSCaching
Java HotSpot(TM) 64-Bit Server VM warning: ignoring option MaxPermSize=768m; support was removed
in 8.0
Running org.apache.hadoop.io.TestSequenceFileMergeProgress
Tests run: 3, Failures: 0, Errors: 0, Skipped: 0, Time elapsed: 1.391 sec - in org.apache.hadoop.io.TestSequenceFileMergeProgress
Java HotSpot(TM) 64-Bit Server VM warning: ignoring option MaxPermSize=768m; support was removed
in 8.0
Running org.apache.hadoop.conf.TestNoDefaultsJobConf
Tests run: 1, Failures: 0, Errors: 0, Skipped: 0, Time elapsed: 22.035 sec - in org.apache.hadoop.conf.TestNoDefaultsJobConf

Results :

Failed tests: 
  TestMRJobsWithProfiler.testDefaultProfiler:111->testProfilerInternal:212 expected:<4>
but was:<1>
  TestNetworkedJob.testNetworkedJob:174 expected:<[[Tue Jan 12 03:22:36 +0000 2016] Application
is Activated, waiting for resources to be assigned for AM.  Details : AM Partition = <DEFAULT_PARTITION>
; Partition Resource = <memory:8192, vCores:16> ; Queue's Absolute capacity = 100.0
% ; Queue's Absolute used capacity = 0.0 % ; Queue's Absolute max capacity = 100.0 % ; ]>
but was:<[]>
  TestJobCleanup.testDefaultCleanupAndAbort:268->testSuccessfulJob:171 Done file "/home/jenkins/jenkins-slave/workspace/Hadoop-Mapreduce-trunk-Java8/hadoop-mapreduce-project/hadoop-mapreduce-client/hadoop-mapreduce-client-jobclient/target/test-dir/test-job-cleanup/output-3/_SUCCESS"
missing for job job_1452569067419_0004
  TestJobCleanup.testCustomAbort:288->testSuccessfulJob:171 Done file "/home/jenkins/jenkins-slave/workspace/Hadoop-Mapreduce-trunk-Java8/hadoop-mapreduce-project/hadoop-mapreduce-client/hadoop-mapreduce-client-jobclient/target/test-dir/test-job-cleanup/output-4/_SUCCESS"
missing for job job_1452569067419_0005

Tests in error: 
  TestMRJobsWithProfiler.testDifferentProfilers:117->testProfilerInternal:150 ยป IO

Tests run: 523, Failures: 4, Errors: 1, Skipped: 11

[INFO] ------------------------------------------------------------------------
[INFO] Reactor Summary:
[INFO] 
[INFO] Apache Hadoop MapReduce Client .................... SUCCESS [  2.447 s]
[INFO] Apache Hadoop MapReduce Core ...................... SUCCESS [01:40 min]
[INFO] Apache Hadoop MapReduce Common .................... SUCCESS [ 25.772 s]
[INFO] Apache Hadoop MapReduce Shuffle ................... SUCCESS [  4.132 s]
[INFO] Apache Hadoop MapReduce App ....................... SUCCESS [10:47 min]
[INFO] Apache Hadoop MapReduce HistoryServer ............. SUCCESS [06:06 min]
[INFO] Apache Hadoop MapReduce JobClient ................. FAILURE [  01:48 h]
[INFO] Apache Hadoop MapReduce HistoryServer Plugins ..... SKIPPED
[INFO] Apache Hadoop MapReduce NativeTask ................ SKIPPED
[INFO] Apache Hadoop MapReduce Examples .................. SKIPPED
[INFO] Apache Hadoop MapReduce ........................... SKIPPED
[INFO] ------------------------------------------------------------------------
[INFO] BUILD FAILURE
[INFO] ------------------------------------------------------------------------
[INFO] Total time: 02:08 h
[INFO] Finished at: 2016-01-12T03:58:27+00:00
[INFO] Final Memory: 34M/178M
[INFO] ------------------------------------------------------------------------
[ERROR] Failed to execute goal org.apache.maven.plugins:maven-surefire-plugin:2.17:test (default-test)
on project hadoop-mapreduce-client-jobclient: There was a timeout or other error in the fork
-> [Help 1]
[ERROR] 
[ERROR] To see the full stack trace of the errors, re-run Maven with the -e switch.
[ERROR] Re-run Maven using the -X switch to enable full debug logging.
[ERROR] 
[ERROR] For more information about the errors and possible solutions, please read the following
articles:
[ERROR] [Help 1] http://cwiki.apache.org/confluence/display/MAVEN/MojoFailureException
[ERROR] 
[ERROR] After correcting the problems, you can resume the build with the command
[ERROR]   mvn <goals> -rf :hadoop-mapreduce-client-jobclient
Build step 'Execute shell' marked build as failure
[FINDBUGS] Skipping publisher since build result is FAILURE
Archiving artifacts
Recording test results
Email was triggered for: Failure - Any
Sending email for trigger: Failure - Any



###################################################################################
############################## FAILED TESTS (if any) ##############################
5 tests failed.
FAILED:  org.apache.hadoop.mapred.TestJobCleanup.testDefaultCleanupAndAbort

Error Message:
Done file "/home/jenkins/jenkins-slave/workspace/Hadoop-Mapreduce-trunk-Java8/hadoop-mapreduce-project/hadoop-mapreduce-client/hadoop-mapreduce-client-jobclient/target/test-dir/test-job-cleanup/output-3/_SUCCESS"
missing for job job_1452569067419_0004

Stack Trace:
java.lang.AssertionError: Done file "/home/jenkins/jenkins-slave/workspace/Hadoop-Mapreduce-trunk-Java8/hadoop-mapreduce-project/hadoop-mapreduce-client/hadoop-mapreduce-client-jobclient/target/test-dir/test-job-cleanup/output-3/_SUCCESS"
missing for job job_1452569067419_0004
	at org.junit.Assert.fail(Assert.java:88)
	at org.junit.Assert.assertTrue(Assert.java:41)
	at org.apache.hadoop.mapred.TestJobCleanup.testSuccessfulJob(TestJobCleanup.java:171)
	at org.apache.hadoop.mapred.TestJobCleanup.testDefaultCleanupAndAbort(TestJobCleanup.java:268)


FAILED:  org.apache.hadoop.mapred.TestJobCleanup.testCustomAbort

Error Message:
Done file "/home/jenkins/jenkins-slave/workspace/Hadoop-Mapreduce-trunk-Java8/hadoop-mapreduce-project/hadoop-mapreduce-client/hadoop-mapreduce-client-jobclient/target/test-dir/test-job-cleanup/output-4/_SUCCESS"
missing for job job_1452569067419_0005

Stack Trace:
java.lang.AssertionError: Done file "/home/jenkins/jenkins-slave/workspace/Hadoop-Mapreduce-trunk-Java8/hadoop-mapreduce-project/hadoop-mapreduce-client/hadoop-mapreduce-client-jobclient/target/test-dir/test-job-cleanup/output-4/_SUCCESS"
missing for job job_1452569067419_0005
	at org.junit.Assert.fail(Assert.java:88)
	at org.junit.Assert.assertTrue(Assert.java:41)
	at org.apache.hadoop.mapred.TestJobCleanup.testSuccessfulJob(TestJobCleanup.java:171)
	at org.apache.hadoop.mapred.TestJobCleanup.testCustomAbort(TestJobCleanup.java:288)


FAILED:  org.apache.hadoop.mapreduce.v2.TestMRJobsWithProfiler.testDefaultProfiler

Error Message:
expected:<4> but was:<1>

Stack Trace:
java.lang.AssertionError: expected:<4> but was:<1>
	at org.junit.Assert.fail(Assert.java:88)
	at org.junit.Assert.failNotEquals(Assert.java:743)
	at org.junit.Assert.assertEquals(Assert.java:118)
	at org.junit.Assert.assertEquals(Assert.java:555)
	at org.junit.Assert.assertEquals(Assert.java:542)
	at org.apache.hadoop.mapreduce.v2.TestMRJobsWithProfiler.testProfilerInternal(TestMRJobsWithProfiler.java:212)
	at org.apache.hadoop.mapreduce.v2.TestMRJobsWithProfiler.testDefaultProfiler(TestMRJobsWithProfiler.java:111)


FAILED:  org.apache.hadoop.mapreduce.v2.TestMRJobsWithProfiler.testDifferentProfilers

Error Message:
java.io.IOException: Unknown Job job_1452567272427_0002
 at org.apache.hadoop.mapreduce.v2.hs.HistoryClientService$HSClientProtocolHandler.verifyAndGetJob(HistoryClientService.java:218)
 at org.apache.hadoop.mapreduce.v2.hs.HistoryClientService$HSClientProtocolHandler.getTaskAttemptCompletionEvents(HistoryClientService.java:281)
 at org.apache.hadoop.mapreduce.v2.api.impl.pb.service.MRClientProtocolPBServiceImpl.getTaskAttemptCompletionEvents(MRClientProtocolPBServiceImpl.java:173)
 at org.apache.hadoop.yarn.proto.MRClientProtocol$MRClientProtocolService$2.callBlockingMethod(MRClientProtocol.java:283)
 at org.apache.hadoop.ipc.ProtobufRpcEngine$Server$ProtoBufRpcInvoker.call(ProtobufRpcEngine.java:637)
 at org.apache.hadoop.ipc.RPC$Server.call(RPC.java:989)
 at org.apache.hadoop.ipc.Server$Handler$1.run(Server.java:2305)
 at org.apache.hadoop.ipc.Server$Handler$1.run(Server.java:2301)
 at java.security.AccessController.doPrivileged(Native Method)
 at javax.security.auth.Subject.doAs(Subject.java:422)
 at org.apache.hadoop.security.UserGroupInformation.doAs(UserGroupInformation.java:1705)
 at org.apache.hadoop.ipc.Server$Handler.run(Server.java:2301)


Stack Trace:
java.io.IOException: java.io.IOException: Unknown Job job_1452567272427_0002
	at org.apache.hadoop.mapreduce.v2.hs.HistoryClientService$HSClientProtocolHandler.verifyAndGetJob(HistoryClientService.java:218)
	at org.apache.hadoop.mapreduce.v2.hs.HistoryClientService$HSClientProtocolHandler.getTaskAttemptCompletionEvents(HistoryClientService.java:281)
	at org.apache.hadoop.mapreduce.v2.api.impl.pb.service.MRClientProtocolPBServiceImpl.getTaskAttemptCompletionEvents(MRClientProtocolPBServiceImpl.java:173)
	at org.apache.hadoop.yarn.proto.MRClientProtocol$MRClientProtocolService$2.callBlockingMethod(MRClientProtocol.java:283)
	at org.apache.hadoop.ipc.ProtobufRpcEngine$Server$ProtoBufRpcInvoker.call(ProtobufRpcEngine.java:637)
	at org.apache.hadoop.ipc.RPC$Server.call(RPC.java:989)
	at org.apache.hadoop.ipc.Server$Handler$1.run(Server.java:2305)
	at org.apache.hadoop.ipc.Server$Handler$1.run(Server.java:2301)
	at java.security.AccessController.doPrivileged(Native Method)
	at javax.security.auth.Subject.doAs(Subject.java:422)
	at org.apache.hadoop.security.UserGroupInformation.doAs(UserGroupInformation.java:1705)
	at org.apache.hadoop.ipc.Server$Handler.run(Server.java:2301)

	at org.apache.hadoop.ipc.Client.call(Client.java:1448)
	at org.apache.hadoop.ipc.Client.call(Client.java:1385)
	at org.apache.hadoop.ipc.ProtobufRpcEngine$Invoker.invoke(ProtobufRpcEngine.java:230)
	at com.sun.proxy.$Proxy89.getTaskAttemptCompletionEvents(Unknown Source)
	at org.apache.hadoop.mapreduce.v2.api.impl.pb.client.MRClientProtocolPBClientImpl.getTaskAttemptCompletionEvents(MRClientProtocolPBClientImpl.java:177)
	at sun.reflect.GeneratedMethodAccessor30.invoke(Unknown Source)
	at sun.reflect.DelegatingMethodAccessorImpl.invoke(DelegatingMethodAccessorImpl.java:43)
	at java.lang.reflect.Method.invoke(Method.java:483)
	at org.apache.hadoop.mapred.ClientServiceDelegate.invoke(ClientServiceDelegate.java:324)
	at org.apache.hadoop.mapred.ClientServiceDelegate.getTaskCompletionEvents(ClientServiceDelegate.java:396)
	at org.apache.hadoop.mapred.YARNRunner.getTaskCompletionEvents(YARNRunner.java:625)
	at org.apache.hadoop.mapreduce.Job$6.run(Job.java:724)
	at org.apache.hadoop.mapreduce.Job$6.run(Job.java:721)
	at java.security.AccessController.doPrivileged(Native Method)
	at javax.security.auth.Subject.doAs(Subject.java:422)
	at org.apache.hadoop.security.UserGroupInformation.doAs(UserGroupInformation.java:1705)
	at org.apache.hadoop.mapreduce.Job.getTaskCompletionEvents(Job.java:721)
	at org.apache.hadoop.mapreduce.Job.monitorAndPrintJob(Job.java:1423)
	at org.apache.hadoop.mapreduce.Job.waitForCompletion(Job.java:1362)
	at org.apache.hadoop.mapreduce.v2.TestMRJobsWithProfiler.testProfilerInternal(TestMRJobsWithProfiler.java:150)
	at org.apache.hadoop.mapreduce.v2.TestMRJobsWithProfiler.testDifferentProfilers(TestMRJobsWithProfiler.java:117)


FAILED:  org.apache.hadoop.mapred.TestNetworkedJob.testNetworkedJob

Error Message:
expected:<[[Tue Jan 12 03:22:36 +0000 2016] Application is Activated, waiting for resources
to be assigned for AM.  Details : AM Partition = <DEFAULT_PARTITION> ; Partition Resource
= <memory:8192, vCores:16> ; Queue's Absolute capacity = 100.0 % ; Queue's Absolute
used capacity = 0.0 % ; Queue's Absolute max capacity = 100.0 % ; ]> but was:<[]>

Stack Trace:
org.junit.ComparisonFailure: expected:<[[Tue Jan 12 03:22:36 +0000 2016] Application is
Activated, waiting for resources to be assigned for AM.  Details : AM Partition = <DEFAULT_PARTITION>
; Partition Resource = <memory:8192, vCores:16> ; Queue's Absolute capacity = 100.0
% ; Queue's Absolute used capacity = 0.0 % ; Queue's Absolute max capacity = 100.0 % ; ]>
but was:<[]>
	at org.junit.Assert.assertEquals(Assert.java:115)
	at org.junit.Assert.assertEquals(Assert.java:144)
	at org.apache.hadoop.mapred.TestNetworkedJob.testNetworkedJob(TestNetworkedJob.java:174)



Mime
  • Unnamed multipart/mixed (inline, None, 0 bytes)
View raw message