hadoop-mapreduce-dev mailing list archives

Site index · List index
Message view « Date » · « Thread »
Top « Date » · « Thread »
From Apache Jenkins Server <jenk...@builds.apache.org>
Subject Hadoop-Mapreduce-trunk - Build # 2818 - Still Failing
Date Tue, 12 Jan 2016 09:44:03 GMT
See https://builds.apache.org/job/Hadoop-Mapreduce-trunk/2818/

###################################################################################
########################## LAST 60 LINES OF THE CONSOLE ###########################
[...truncated 32951 lines...]
Tests run: 1, Failures: 0, Errors: 0, Skipped: 0, Time elapsed: 93.639 sec - in org.apache.hadoop.mapred.TestJobSysDirWithDFS
Running org.apache.hadoop.mapred.TestReduceTask
Tests run: 2, Failures: 0, Errors: 0, Skipped: 0, Time elapsed: 1.371 sec - in org.apache.hadoop.mapred.TestReduceTask
Running org.apache.hadoop.mapred.TestBadRecords
Tests run: 1, Failures: 0, Errors: 0, Skipped: 1, Time elapsed: 0.047 sec - in org.apache.hadoop.mapred.TestBadRecords
Running org.apache.hadoop.mapred.TestMiniMRDFSCaching
Tests run: 1, Failures: 0, Errors: 0, Skipped: 1, Time elapsed: 0.047 sec - in org.apache.hadoop.mapred.TestMiniMRDFSCaching
Running org.apache.hadoop.io.TestSequenceFileMergeProgress
Tests run: 3, Failures: 0, Errors: 0, Skipped: 0, Time elapsed: 2.371 sec - in org.apache.hadoop.io.TestSequenceFileMergeProgress
Running org.apache.hadoop.conf.TestNoDefaultsJobConf
Tests run: 1, Failures: 0, Errors: 0, Skipped: 0, Time elapsed: 22.524 sec - in org.apache.hadoop.conf.TestNoDefaultsJobConf

Results :

Failed tests: 
  TestNetworkedJob.testNetworkedJob:174 expected:<[[Tue Jan 12 09:12:57 +0000 2016] Application
is Activated, waiting for resources to be assigned for AM.  Details : AM Partition = <DEFAULT_PARTITION>
; Partition Resource = <memory:8192, vCores:16> ; Queue's Absolute capacity = 100.0
% ; Queue's Absolute used capacity = 0.0 % ; Queue's Absolute max capacity = 100.0 % ; ]>
but was:<[]>
  TestJobCleanup.testDefaultCleanupAndAbort:268->testSuccessfulJob:171 Done file "/home/jenkins/jenkins-slave/workspace/Hadoop-Mapreduce-trunk/hadoop-mapreduce-project/hadoop-mapreduce-client/hadoop-mapreduce-client-jobclient/target/test-dir/test-job-cleanup/output-3/_SUCCESS"
missing for job job_1452590093882_0004

Tests run: 523, Failures: 2, Errors: 0, Skipped: 11

[INFO] ------------------------------------------------------------------------
[INFO] Reactor Summary:
[INFO] 
[INFO] Apache Hadoop MapReduce Client .................... SUCCESS [  3.141 s]
[INFO] Apache Hadoop MapReduce Core ...................... SUCCESS [01:58 min]
[INFO] Apache Hadoop MapReduce Common .................... SUCCESS [ 30.318 s]
[INFO] Apache Hadoop MapReduce Shuffle ................... SUCCESS [  5.140 s]
[INFO] Apache Hadoop MapReduce App ....................... SUCCESS [09:18 min]
[INFO] Apache Hadoop MapReduce HistoryServer ............. SUCCESS [05:39 min]
[INFO] Apache Hadoop MapReduce JobClient ................. FAILURE [  01:56 h]
[INFO] Apache Hadoop MapReduce HistoryServer Plugins ..... SKIPPED
[INFO] Apache Hadoop MapReduce NativeTask ................ SKIPPED
[INFO] Apache Hadoop MapReduce Examples .................. SKIPPED
[INFO] Apache Hadoop MapReduce ........................... SKIPPED
[INFO] ------------------------------------------------------------------------
[INFO] BUILD FAILURE
[INFO] ------------------------------------------------------------------------
[INFO] Total time: 02:14 h
[INFO] Finished at: 2016-01-12T09:43:53+00:00
[INFO] Final Memory: 38M/655M
[INFO] ------------------------------------------------------------------------
[ERROR] Failed to execute goal org.apache.maven.plugins:maven-surefire-plugin:2.17:test (default-test)
on project hadoop-mapreduce-client-jobclient: ExecutionException: java.lang.RuntimeException:
The forked VM terminated without properly saying goodbye. VM crash or System.exit called?
[ERROR] Command was /bin/sh -c cd /home/jenkins/jenkins-slave/workspace/Hadoop-Mapreduce-trunk/hadoop-mapreduce-project/hadoop-mapreduce-client/hadoop-mapreduce-client-jobclient
&& /home/jenkins/tools/java/jdk1.7.0_55/jre/bin/java -Xmx2048m -XX:MaxPermSize=768m
-XX:+HeapDumpOnOutOfMemoryError -jar /home/jenkins/jenkins-slave/workspace/Hadoop-Mapreduce-trunk/hadoop-mapreduce-project/hadoop-mapreduce-client/hadoop-mapreduce-client-jobclient/target/surefire/surefirebooter7161410545314727083.jar
/home/jenkins/jenkins-slave/workspace/Hadoop-Mapreduce-trunk/hadoop-mapreduce-project/hadoop-mapreduce-client/hadoop-mapreduce-client-jobclient/target/surefire/surefire1893065502905171549tmp
/home/jenkins/jenkins-slave/workspace/Hadoop-Mapreduce-trunk/hadoop-mapreduce-project/hadoop-mapreduce-client/hadoop-mapreduce-client-jobclient/target/surefire/surefire_233917528496637194498tmp
[ERROR] -> [Help 1]
[ERROR] 
[ERROR] To see the full stack trace of the errors, re-run Maven with the -e switch.
[ERROR] Re-run Maven using the -X switch to enable full debug logging.
[ERROR] 
[ERROR] For more information about the errors and possible solutions, please read the following
articles:
[ERROR] [Help 1] http://cwiki.apache.org/confluence/display/MAVEN/MojoFailureException
[ERROR] 
[ERROR] After correcting the problems, you can resume the build with the command
[ERROR]   mvn <goals> -rf :hadoop-mapreduce-client-jobclient
Build step 'Execute shell' marked build as failure
[FINDBUGS] Skipping publisher since build result is FAILURE
Archiving artifacts
Recording test results
Email was triggered for: Failure - Any
Sending email for trigger: Failure - Any



###################################################################################
############################## FAILED TESTS (if any) ##############################
2 tests failed.
FAILED:  org.apache.hadoop.mapred.TestJobCleanup.testDefaultCleanupAndAbort

Error Message:
Done file "/home/jenkins/jenkins-slave/workspace/Hadoop-Mapreduce-trunk/hadoop-mapreduce-project/hadoop-mapreduce-client/hadoop-mapreduce-client-jobclient/target/test-dir/test-job-cleanup/output-3/_SUCCESS"
missing for job job_1452590093882_0004

Stack Trace:
java.lang.AssertionError: Done file "/home/jenkins/jenkins-slave/workspace/Hadoop-Mapreduce-trunk/hadoop-mapreduce-project/hadoop-mapreduce-client/hadoop-mapreduce-client-jobclient/target/test-dir/test-job-cleanup/output-3/_SUCCESS"
missing for job job_1452590093882_0004
	at org.junit.Assert.fail(Assert.java:88)
	at org.junit.Assert.assertTrue(Assert.java:41)
	at org.apache.hadoop.mapred.TestJobCleanup.testSuccessfulJob(TestJobCleanup.java:171)
	at org.apache.hadoop.mapred.TestJobCleanup.testDefaultCleanupAndAbort(TestJobCleanup.java:268)


FAILED:  org.apache.hadoop.mapred.TestNetworkedJob.testNetworkedJob

Error Message:
expected:<[[Tue Jan 12 09:12:57 +0000 2016] Application is Activated, waiting for resources
to be assigned for AM.  Details : AM Partition = <DEFAULT_PARTITION> ; Partition Resource
= <memory:8192, vCores:16> ; Queue's Absolute capacity = 100.0 % ; Queue's Absolute
used capacity = 0.0 % ; Queue's Absolute max capacity = 100.0 % ; ]> but was:<[]>

Stack Trace:
org.junit.ComparisonFailure: expected:<[[Tue Jan 12 09:12:57 +0000 2016] Application is
Activated, waiting for resources to be assigned for AM.  Details : AM Partition = <DEFAULT_PARTITION>
; Partition Resource = <memory:8192, vCores:16> ; Queue's Absolute capacity = 100.0
% ; Queue's Absolute used capacity = 0.0 % ; Queue's Absolute max capacity = 100.0 % ; ]>
but was:<[]>
	at org.junit.Assert.assertEquals(Assert.java:115)
	at org.junit.Assert.assertEquals(Assert.java:144)
	at org.apache.hadoop.mapred.TestNetworkedJob.testNetworkedJob(TestNetworkedJob.java:174)



Mime
  • Unnamed multipart/mixed (inline, None, 0 bytes)
View raw message