hadoop-mapreduce-dev mailing list archives

Site index · List index
Message view « Date » · « Thread »
Top « Date » · « Thread »
From Apache Jenkins Server <jenk...@builds.apache.org>
Subject Hadoop-Mapreduce-trunk-Java8 - Build # 881 - Still Failing
Date Tue, 12 Jan 2016 10:51:55 GMT
See https://builds.apache.org/job/Hadoop-Mapreduce-trunk-Java8/881/

###################################################################################
########################## LAST 60 LINES OF THE CONSOLE ###########################
[...truncated 10817 lines...]
Running org.apache.hadoop.mapred.TestBadRecords
Tests run: 1, Failures: 0, Errors: 0, Skipped: 1, Time elapsed: 0.036 sec - in org.apache.hadoop.mapred.TestBadRecords
Java HotSpot(TM) 64-Bit Server VM warning: ignoring option MaxPermSize=768m; support was removed
in 8.0
Running org.apache.hadoop.mapred.TestMiniMRDFSCaching
Tests run: 1, Failures: 0, Errors: 0, Skipped: 1, Time elapsed: 0.036 sec - in org.apache.hadoop.mapred.TestMiniMRDFSCaching
Java HotSpot(TM) 64-Bit Server VM warning: ignoring option MaxPermSize=768m; support was removed
in 8.0
Running org.apache.hadoop.io.TestSequenceFileMergeProgress
Tests run: 3, Failures: 0, Errors: 0, Skipped: 0, Time elapsed: 1.412 sec - in org.apache.hadoop.io.TestSequenceFileMergeProgress
Java HotSpot(TM) 64-Bit Server VM warning: ignoring option MaxPermSize=768m; support was removed
in 8.0
Running org.apache.hadoop.conf.TestNoDefaultsJobConf
Tests run: 1, Failures: 0, Errors: 0, Skipped: 0, Time elapsed: 24.208 sec - in org.apache.hadoop.conf.TestNoDefaultsJobConf

Results :

Failed tests: 
  TestNetworkedJob.testNetworkedJob:174 expected:<[[Tue Jan 12 10:23:19 +0000 2016] Application
is Activated, waiting for resources to be assigned for AM.  Details : AM Partition = <DEFAULT_PARTITION>
; Partition Resource = <memory:8192, vCores:16> ; Queue's Absolute capacity = 100.0
% ; Queue's Absolute used capacity = 0.0 % ; Queue's Absolute max capacity = 100.0 % ; ]>
but was:<[]>

Tests run: 527, Failures: 1, Errors: 0, Skipped: 11

[INFO] ------------------------------------------------------------------------
[INFO] Reactor Summary:
[INFO] 
[INFO] Apache Hadoop MapReduce Client .................... SUCCESS [  2.206 s]
[INFO] Apache Hadoop MapReduce Core ...................... SUCCESS [01:38 min]
[INFO] Apache Hadoop MapReduce Common .................... SUCCESS [ 25.619 s]
[INFO] Apache Hadoop MapReduce Shuffle ................... SUCCESS [  4.112 s]
[INFO] Apache Hadoop MapReduce App ....................... SUCCESS [10:49 min]
[INFO] Apache Hadoop MapReduce HistoryServer ............. SUCCESS [06:07 min]
[INFO] Apache Hadoop MapReduce JobClient ................. FAILURE [  01:41 h]
[INFO] Apache Hadoop MapReduce HistoryServer Plugins ..... SKIPPED
[INFO] Apache Hadoop MapReduce NativeTask ................ SKIPPED
[INFO] Apache Hadoop MapReduce Examples .................. SKIPPED
[INFO] Apache Hadoop MapReduce ........................... SKIPPED
[INFO] ------------------------------------------------------------------------
[INFO] BUILD FAILURE
[INFO] ------------------------------------------------------------------------
[INFO] Total time: 02:00 h
[INFO] Finished at: 2016-01-12T10:51:46+00:00
[INFO] Final Memory: 34M/239M
[INFO] ------------------------------------------------------------------------
[ERROR] Failed to execute goal org.apache.maven.plugins:maven-surefire-plugin:2.17:test (default-test)
on project hadoop-mapreduce-client-jobclient: There are test failures.
[ERROR] 
[ERROR] Please refer to /home/jenkins/jenkins-slave/workspace/Hadoop-Mapreduce-trunk-Java8/hadoop-mapreduce-project/hadoop-mapreduce-client/hadoop-mapreduce-client-jobclient/target/surefire-reports
for the individual test results.
[ERROR] -> [Help 1]
[ERROR] 
[ERROR] To see the full stack trace of the errors, re-run Maven with the -e switch.
[ERROR] Re-run Maven using the -X switch to enable full debug logging.
[ERROR] 
[ERROR] For more information about the errors and possible solutions, please read the following
articles:
[ERROR] [Help 1] http://cwiki.apache.org/confluence/display/MAVEN/MojoFailureException
[ERROR] 
[ERROR] After correcting the problems, you can resume the build with the command
[ERROR]   mvn <goals> -rf :hadoop-mapreduce-client-jobclient
Build step 'Execute shell' marked build as failure
[FINDBUGS] Skipping publisher since build result is FAILURE
Archiving artifacts
Recording test results
Email was triggered for: Failure - Any
Sending email for trigger: Failure - Any



###################################################################################
############################## FAILED TESTS (if any) ##############################
1 tests failed.
FAILED:  org.apache.hadoop.mapred.TestNetworkedJob.testNetworkedJob

Error Message:
expected:<[[Tue Jan 12 10:23:19 +0000 2016] Application is Activated, waiting for resources
to be assigned for AM.  Details : AM Partition = <DEFAULT_PARTITION> ; Partition Resource
= <memory:8192, vCores:16> ; Queue's Absolute capacity = 100.0 % ; Queue's Absolute
used capacity = 0.0 % ; Queue's Absolute max capacity = 100.0 % ; ]> but was:<[]>

Stack Trace:
org.junit.ComparisonFailure: expected:<[[Tue Jan 12 10:23:19 +0000 2016] Application is
Activated, waiting for resources to be assigned for AM.  Details : AM Partition = <DEFAULT_PARTITION>
; Partition Resource = <memory:8192, vCores:16> ; Queue's Absolute capacity = 100.0
% ; Queue's Absolute used capacity = 0.0 % ; Queue's Absolute max capacity = 100.0 % ; ]>
but was:<[]>
	at org.junit.Assert.assertEquals(Assert.java:115)
	at org.junit.Assert.assertEquals(Assert.java:144)
	at org.apache.hadoop.mapred.TestNetworkedJob.testNetworkedJob(TestNetworkedJob.java:174)



Mime
  • Unnamed multipart/mixed (inline, None, 0 bytes)
View raw message