hadoop-mapreduce-dev mailing list archives

Site index · List index
Message view « Date » · « Thread »
Top « Date » · « Thread »
From Apache Jenkins Server <jenk...@builds.apache.org>
Subject Hadoop-Mapreduce-trunk - Build # 2800 - Still Failing
Date Thu, 07 Jan 2016 16:13:59 GMT
See https://builds.apache.org/job/Hadoop-Mapreduce-trunk/2800/

###################################################################################
########################## LAST 60 LINES OF THE CONSOLE ###########################
[...truncated 32534 lines...]

Running org.apache.hadoop.mapreduce.jobhistory.TestJobSummary
Tests run: 1, Failures: 0, Errors: 0, Skipped: 0, Time elapsed: 0.401 sec - in org.apache.hadoop.mapreduce.jobhistory.TestJobSummary
Running org.apache.hadoop.mapreduce.jobhistory.TestEvents
Tests run: 5, Failures: 0, Errors: 0, Skipped: 0, Time elapsed: 0.813 sec - in org.apache.hadoop.mapreduce.jobhistory.TestEvents

Results :

Tests in error: 
  TestMRAppComponentDependencies.testComponentStopOrder:46 » NoClassDefFound org...
  TestFail.testMapFailureMaxPercent:104 » YarnRuntime could not cleanup test dir
  TestFail.testTimedOutTask:153 » YarnRuntime could not cleanup test dir
  TestFail.testFailTask:65 » YarnRuntime could not cleanup test dir
  TestFail.testTaskFailWithUnusedContainer:179 » YarnRuntime could not cleanup t...
  TestFail.testReduceFailureMaxPercent:119 » YarnRuntime could not cleanup test ...
  TestJobHistoryEventHandler.testTimelineEventHandling:496 » NoClassDefFound org...

Tests run: 340, Failures: 0, Errors: 7, Skipped: 0

[INFO] ------------------------------------------------------------------------
[INFO] Reactor Summary:
[INFO] 
[INFO] Apache Hadoop MapReduce Client .................... SUCCESS [  3.984 s]
[INFO] Apache Hadoop MapReduce Core ...................... SUCCESS [02:03 min]
[INFO] Apache Hadoop MapReduce Common .................... SUCCESS [ 31.093 s]
[INFO] Apache Hadoop MapReduce Shuffle ................... SUCCESS [  5.474 s]
[INFO] Apache Hadoop MapReduce App ....................... FAILURE [09:26 min]
[INFO] Apache Hadoop MapReduce HistoryServer ............. SKIPPED
[INFO] Apache Hadoop MapReduce JobClient ................. SKIPPED
[INFO] Apache Hadoop MapReduce HistoryServer Plugins ..... SKIPPED
[INFO] Apache Hadoop MapReduce NativeTask ................ SKIPPED
[INFO] Apache Hadoop MapReduce Examples .................. SKIPPED
[INFO] Apache Hadoop MapReduce ........................... SKIPPED
[INFO] ------------------------------------------------------------------------
[INFO] BUILD FAILURE
[INFO] ------------------------------------------------------------------------
[INFO] Total time: 12:12 min
[INFO] Finished at: 2016-01-07T16:13:55+00:00
[INFO] Final Memory: 45M/1215M
[INFO] ------------------------------------------------------------------------
[ERROR] Failed to execute goal org.apache.maven.plugins:maven-surefire-plugin:2.17:test (default-test)
on project hadoop-mapreduce-client-app: There are test failures.
[ERROR] 
[ERROR] Please refer to /home/jenkins/jenkins-slave/workspace/Hadoop-Mapreduce-trunk/hadoop-mapreduce-project/hadoop-mapreduce-client/hadoop-mapreduce-client-app/target/surefire-reports
for the individual test results.
[ERROR] -> [Help 1]
[ERROR] 
[ERROR] To see the full stack trace of the errors, re-run Maven with the -e switch.
[ERROR] Re-run Maven using the -X switch to enable full debug logging.
[ERROR] 
[ERROR] For more information about the errors and possible solutions, please read the following
articles:
[ERROR] [Help 1] http://cwiki.apache.org/confluence/display/MAVEN/MojoFailureException
[ERROR] 
[ERROR] After correcting the problems, you can resume the build with the command
[ERROR]   mvn <goals> -rf :hadoop-mapreduce-client-app
Build step 'Execute shell' marked build as failure
[FINDBUGS] Skipping publisher since build result is FAILURE
Archiving artifacts
Recording test results
Email was triggered for: Failure - Any
Sending email for trigger: Failure - Any



###################################################################################
############################## FAILED TESTS (if any) ##############################
7 tests failed.
FAILED:  org.apache.hadoop.mapreduce.jobhistory.TestJobHistoryEventHandler.testTimelineEventHandling

Error Message:
org/apache/hadoop/yarn/event/Dispatcher

Stack Trace:
java.lang.NoClassDefFoundError: org/apache/hadoop/yarn/event/Dispatcher
	at java.net.URLClassLoader$1.run(URLClassLoader.java:366)
	at java.net.URLClassLoader$1.run(URLClassLoader.java:355)
	at java.security.AccessController.doPrivileged(Native Method)
	at java.net.URLClassLoader.findClass(URLClassLoader.java:354)
	at java.lang.ClassLoader.loadClass(ClassLoader.java:425)
	at sun.misc.Launcher$AppClassLoader.loadClass(Launcher.java:308)
	at java.lang.ClassLoader.loadClass(ClassLoader.java:358)
	at org.apache.hadoop.yarn.server.MiniYARNCluster.createResourceManager(MiniYARNCluster.java:807)
	at org.apache.hadoop.yarn.server.MiniYARNCluster.serviceInit(MiniYARNCluster.java:253)
	at org.apache.hadoop.service.AbstractService.init(AbstractService.java:163)
	at org.apache.hadoop.mapreduce.jobhistory.TestJobHistoryEventHandler.testTimelineEventHandling(TestJobHistoryEventHandler.java:496)


FAILED:  org.apache.hadoop.mapreduce.v2.app.TestFail.testMapFailureMaxPercent

Error Message:
could not cleanup test dir

Stack Trace:
org.apache.hadoop.yarn.exceptions.YarnRuntimeException: could not cleanup test dir
	at org.apache.hadoop.fs.AbstractFileSystem.createFileSystem(AbstractFileSystem.java:161)
	at org.apache.hadoop.fs.AbstractFileSystem.get(AbstractFileSystem.java:250)
	at org.apache.hadoop.fs.FileContext$2.run(FileContext.java:332)
	at org.apache.hadoop.fs.FileContext$2.run(FileContext.java:329)
	at java.security.AccessController.doPrivileged(Native Method)
	at javax.security.auth.Subject.doAs(Subject.java:415)
	at org.apache.hadoop.security.UserGroupInformation.doAs(UserGroupInformation.java:1705)
	at org.apache.hadoop.fs.FileContext.getAbstractFileSystem(FileContext.java:329)
	at org.apache.hadoop.fs.FileContext.getFileContext(FileContext.java:446)
	at org.apache.hadoop.fs.FileContext.getFileContext(FileContext.java:423)
	at org.apache.hadoop.fs.FileContext.getLocalFSFileContext(FileContext.java:409)
	at org.apache.hadoop.mapreduce.v2.app.MRApp.<init>(MRApp.java:239)
	at org.apache.hadoop.mapreduce.v2.app.MRApp.<init>(MRApp.java:208)
	at org.apache.hadoop.mapreduce.v2.app.MRApp.<init>(MRApp.java:189)
	at org.apache.hadoop.mapreduce.v2.app.MRApp.<init>(MRApp.java:150)
	at org.apache.hadoop.mapreduce.v2.app.TestFail$MockFirstFailingTaskMRApp.<init>(TestFail.java:283)
	at org.apache.hadoop.mapreduce.v2.app.TestFail.testMapFailureMaxPercent(TestFail.java:104)


FAILED:  org.apache.hadoop.mapreduce.v2.app.TestFail.testTimedOutTask

Error Message:
could not cleanup test dir

Stack Trace:
org.apache.hadoop.yarn.exceptions.YarnRuntimeException: could not cleanup test dir
	at org.apache.hadoop.fs.AbstractFileSystem.createFileSystem(AbstractFileSystem.java:161)
	at org.apache.hadoop.fs.AbstractFileSystem.get(AbstractFileSystem.java:250)
	at org.apache.hadoop.fs.FileContext$2.run(FileContext.java:332)
	at org.apache.hadoop.fs.FileContext$2.run(FileContext.java:329)
	at java.security.AccessController.doPrivileged(Native Method)
	at javax.security.auth.Subject.doAs(Subject.java:415)
	at org.apache.hadoop.security.UserGroupInformation.doAs(UserGroupInformation.java:1705)
	at org.apache.hadoop.fs.FileContext.getAbstractFileSystem(FileContext.java:329)
	at org.apache.hadoop.fs.FileContext.getFileContext(FileContext.java:446)
	at org.apache.hadoop.fs.FileContext.getFileContext(FileContext.java:423)
	at org.apache.hadoop.fs.FileContext.getLocalFSFileContext(FileContext.java:409)
	at org.apache.hadoop.mapreduce.v2.app.MRApp.<init>(MRApp.java:239)
	at org.apache.hadoop.mapreduce.v2.app.MRApp.<init>(MRApp.java:208)
	at org.apache.hadoop.mapreduce.v2.app.MRApp.<init>(MRApp.java:189)
	at org.apache.hadoop.mapreduce.v2.app.MRApp.<init>(MRApp.java:150)
	at org.apache.hadoop.mapreduce.v2.app.TestFail$TimeOutTaskMRApp.<init>(TestFail.java:250)
	at org.apache.hadoop.mapreduce.v2.app.TestFail.testTimedOutTask(TestFail.java:153)


FAILED:  org.apache.hadoop.mapreduce.v2.app.TestFail.testFailTask

Error Message:
could not cleanup test dir

Stack Trace:
org.apache.hadoop.yarn.exceptions.YarnRuntimeException: could not cleanup test dir
	at org.apache.hadoop.fs.AbstractFileSystem.createFileSystem(AbstractFileSystem.java:161)
	at org.apache.hadoop.fs.AbstractFileSystem.get(AbstractFileSystem.java:250)
	at org.apache.hadoop.fs.FileContext$2.run(FileContext.java:332)
	at org.apache.hadoop.fs.FileContext$2.run(FileContext.java:329)
	at java.security.AccessController.doPrivileged(Native Method)
	at javax.security.auth.Subject.doAs(Subject.java:415)
	at org.apache.hadoop.security.UserGroupInformation.doAs(UserGroupInformation.java:1705)
	at org.apache.hadoop.fs.FileContext.getAbstractFileSystem(FileContext.java:329)
	at org.apache.hadoop.fs.FileContext.getFileContext(FileContext.java:446)
	at org.apache.hadoop.fs.FileContext.getFileContext(FileContext.java:423)
	at org.apache.hadoop.fs.FileContext.getLocalFSFileContext(FileContext.java:409)
	at org.apache.hadoop.mapreduce.v2.app.MRApp.<init>(MRApp.java:239)
	at org.apache.hadoop.mapreduce.v2.app.MRApp.<init>(MRApp.java:208)
	at org.apache.hadoop.mapreduce.v2.app.MRApp.<init>(MRApp.java:189)
	at org.apache.hadoop.mapreduce.v2.app.MRApp.<init>(MRApp.java:150)
	at org.apache.hadoop.mapreduce.v2.app.TestFail$MockFirstFailingAttemptMRApp.<init>(TestFail.java:304)
	at org.apache.hadoop.mapreduce.v2.app.TestFail.testFailTask(TestFail.java:65)


FAILED:  org.apache.hadoop.mapreduce.v2.app.TestFail.testTaskFailWithUnusedContainer

Error Message:
could not cleanup test dir

Stack Trace:
org.apache.hadoop.yarn.exceptions.YarnRuntimeException: could not cleanup test dir
	at org.apache.hadoop.fs.AbstractFileSystem.createFileSystem(AbstractFileSystem.java:161)
	at org.apache.hadoop.fs.AbstractFileSystem.get(AbstractFileSystem.java:250)
	at org.apache.hadoop.fs.FileContext$2.run(FileContext.java:332)
	at org.apache.hadoop.fs.FileContext$2.run(FileContext.java:329)
	at java.security.AccessController.doPrivileged(Native Method)
	at javax.security.auth.Subject.doAs(Subject.java:415)
	at org.apache.hadoop.security.UserGroupInformation.doAs(UserGroupInformation.java:1705)
	at org.apache.hadoop.fs.FileContext.getAbstractFileSystem(FileContext.java:329)
	at org.apache.hadoop.fs.FileContext.getFileContext(FileContext.java:446)
	at org.apache.hadoop.fs.FileContext.getFileContext(FileContext.java:423)
	at org.apache.hadoop.fs.FileContext.getLocalFSFileContext(FileContext.java:409)
	at org.apache.hadoop.mapreduce.v2.app.MRApp.<init>(MRApp.java:239)
	at org.apache.hadoop.mapreduce.v2.app.MRApp.<init>(MRApp.java:208)
	at org.apache.hadoop.mapreduce.v2.app.MRApp.<init>(MRApp.java:189)
	at org.apache.hadoop.mapreduce.v2.app.MRApp.<init>(MRApp.java:150)
	at org.apache.hadoop.mapreduce.v2.app.TestFail$MRAppWithFailingTaskAndUnusedContainer.<init>(TestFail.java:208)
	at org.apache.hadoop.mapreduce.v2.app.TestFail.testTaskFailWithUnusedContainer(TestFail.java:179)


FAILED:  org.apache.hadoop.mapreduce.v2.app.TestFail.testReduceFailureMaxPercent

Error Message:
could not cleanup test dir

Stack Trace:
org.apache.hadoop.yarn.exceptions.YarnRuntimeException: could not cleanup test dir
	at org.apache.hadoop.fs.AbstractFileSystem.createFileSystem(AbstractFileSystem.java:161)
	at org.apache.hadoop.fs.AbstractFileSystem.get(AbstractFileSystem.java:250)
	at org.apache.hadoop.fs.FileContext$2.run(FileContext.java:332)
	at org.apache.hadoop.fs.FileContext$2.run(FileContext.java:329)
	at java.security.AccessController.doPrivileged(Native Method)
	at javax.security.auth.Subject.doAs(Subject.java:415)
	at org.apache.hadoop.security.UserGroupInformation.doAs(UserGroupInformation.java:1705)
	at org.apache.hadoop.fs.FileContext.getAbstractFileSystem(FileContext.java:329)
	at org.apache.hadoop.fs.FileContext.getFileContext(FileContext.java:446)
	at org.apache.hadoop.fs.FileContext.getFileContext(FileContext.java:423)
	at org.apache.hadoop.fs.FileContext.getLocalFSFileContext(FileContext.java:409)
	at org.apache.hadoop.mapreduce.v2.app.MRApp.<init>(MRApp.java:239)
	at org.apache.hadoop.mapreduce.v2.app.MRApp.<init>(MRApp.java:208)
	at org.apache.hadoop.mapreduce.v2.app.MRApp.<init>(MRApp.java:189)
	at org.apache.hadoop.mapreduce.v2.app.MRApp.<init>(MRApp.java:150)
	at org.apache.hadoop.mapreduce.v2.app.TestFail$MockFirstFailingTaskMRApp.<init>(TestFail.java:283)
	at org.apache.hadoop.mapreduce.v2.app.TestFail.testReduceFailureMaxPercent(TestFail.java:119)


FAILED:  org.apache.hadoop.mapreduce.v2.app.TestMRAppComponentDependencies.testComponentStopOrder

Error Message:
org/apache/hadoop/security/authentication/server/AuthenticationFilter

Stack Trace:
java.lang.NoClassDefFoundError: org/apache/hadoop/security/authentication/server/AuthenticationFilter
	at java.net.URLClassLoader$1.run(URLClassLoader.java:366)
	at java.net.URLClassLoader$1.run(URLClassLoader.java:355)
	at java.security.AccessController.doPrivileged(Native Method)
	at java.net.URLClassLoader.findClass(URLClassLoader.java:354)
	at java.lang.ClassLoader.loadClass(ClassLoader.java:425)
	at sun.misc.Launcher$AppClassLoader.loadClass(Launcher.java:308)
	at java.lang.ClassLoader.loadClass(ClassLoader.java:358)
	at org.apache.hadoop.http.HttpServer2.constructSecretProvider(HttpServer2.java:448)
	at org.apache.hadoop.http.HttpServer2.<init>(HttpServer2.java:340)
	at org.apache.hadoop.http.HttpServer2.<init>(HttpServer2.java:115)
	at org.apache.hadoop.http.HttpServer2$Builder.build(HttpServer2.java:291)
	at org.apache.hadoop.yarn.webapp.WebApps$Builder.build(WebApps.java:261)
	at org.apache.hadoop.yarn.webapp.WebApps$Builder.start(WebApps.java:303)
	at org.apache.hadoop.mapreduce.v2.app.client.MRClientService.serviceStart(MRClientService.java:143)
	at org.apache.hadoop.service.AbstractService.start(AbstractService.java:193)
	at org.apache.hadoop.mapreduce.v2.app.MRAppMaster.serviceStart(MRAppMaster.java:1223)
	at org.apache.hadoop.service.AbstractService.start(AbstractService.java:193)
	at org.apache.hadoop.mapreduce.v2.app.MRApp.submit(MRApp.java:296)
	at org.apache.hadoop.mapreduce.v2.app.MRApp.submit(MRApp.java:280)
	at org.apache.hadoop.mapreduce.v2.app.TestMRAppComponentDependencies.testComponentStopOrder(TestMRAppComponentDependencies.java:46)



Mime
  • Unnamed multipart/mixed (inline, None, 0 bytes)
View raw message