hadoop-mapreduce-dev mailing list archives

Site index · List index
Message view « Date » · « Thread »
Top « Date » · « Thread »
From Apache Jenkins Server <jenk...@builds.apache.org>
Subject Hadoop-Mapreduce-trunk - Build # 2911 - Still Failing
Date Wed, 03 Feb 2016 01:14:24 GMT
See https://builds.apache.org/job/Hadoop-Mapreduce-trunk/2911/

###################################################################################
########################## LAST 60 LINES OF THE CONSOLE ###########################
[...truncated 37726 lines...]
Running org.apache.hadoop.mapred.pipes.TestPipesNonJavaInputFormat
Tests run: 1, Failures: 0, Errors: 0, Skipped: 0, Time elapsed: 1.389 sec - in org.apache.hadoop.mapred.pipes.TestPipesNonJavaInputFormat
Running org.apache.hadoop.mapred.pipes.TestPipeApplication
Tests run: 5, Failures: 0, Errors: 0, Skipped: 0, Time elapsed: 5.537 sec - in org.apache.hadoop.mapred.pipes.TestPipeApplication
Running org.apache.hadoop.mapred.TestJavaSerialization
Tests run: 2, Failures: 0, Errors: 0, Skipped: 0, Time elapsed: 4.542 sec - in org.apache.hadoop.mapred.TestJavaSerialization
Running org.apache.hadoop.mapred.TestSpecialCharactersInOutputPath
Tests run: 1, Failures: 0, Errors: 0, Skipped: 0, Time elapsed: 26.745 sec - in org.apache.hadoop.mapred.TestSpecialCharactersInOutputPath
Running org.apache.hadoop.ipc.TestMRCJCSocketFactory
Tests run: 1, Failures: 0, Errors: 0, Skipped: 0, Time elapsed: 20.199 sec - in org.apache.hadoop.ipc.TestMRCJCSocketFactory

Results :

Failed tests: 
  TestNetworkedJob.testNetworkedJob:174 expected:<[[Wed Feb 03 00:35:23 +0000 2016] Scheduler
has assigned a container for AM, waiting for AM container to be launched]> but was:<[]>

Tests in error: 
  TestMRJobs.testConfVerificationWithClassloader:310->testConfVerification:414 » 
  TestMRJobs.tearDown:177 » NoClassDefFound org/apache/hadoop/service/ServiceOpe...

Tests run: 527, Failures: 1, Errors: 2, Skipped: 11

[INFO] ------------------------------------------------------------------------
[INFO] Reactor Summary:
[INFO] 
[INFO] Apache Hadoop MapReduce Client .................... SUCCESS [  3.007 s]
[INFO] Apache Hadoop MapReduce Core ...................... SUCCESS [01:57 min]
[INFO] Apache Hadoop MapReduce Common .................... SUCCESS [ 30.036 s]
[INFO] Apache Hadoop MapReduce Shuffle ................... SUCCESS [  4.908 s]
[INFO] Apache Hadoop MapReduce App ....................... SUCCESS [09:19 min]
[INFO] Apache Hadoop MapReduce HistoryServer ............. SUCCESS [05:39 min]
[INFO] Apache Hadoop MapReduce JobClient ................. FAILURE [  01:57 h]
[INFO] Apache Hadoop MapReduce HistoryServer Plugins ..... SKIPPED
[INFO] Apache Hadoop MapReduce NativeTask ................ SKIPPED
[INFO] Apache Hadoop MapReduce Examples .................. SKIPPED
[INFO] Apache Hadoop MapReduce ........................... SKIPPED
[INFO] ------------------------------------------------------------------------
[INFO] BUILD FAILURE
[INFO] ------------------------------------------------------------------------
[INFO] Total time: 02:14 h
[INFO] Finished at: 2016-02-03T01:14:13+00:00
[INFO] Final Memory: 40M/750M
[INFO] ------------------------------------------------------------------------
[ERROR] Failed to execute goal org.apache.maven.plugins:maven-surefire-plugin:2.17:test (default-test)
on project hadoop-mapreduce-client-jobclient: There was a timeout or other error in the fork
-> [Help 1]
[ERROR] 
[ERROR] To see the full stack trace of the errors, re-run Maven with the -e switch.
[ERROR] Re-run Maven using the -X switch to enable full debug logging.
[ERROR] 
[ERROR] For more information about the errors and possible solutions, please read the following
articles:
[ERROR] [Help 1] http://cwiki.apache.org/confluence/display/MAVEN/MojoFailureException
[ERROR] 
[ERROR] After correcting the problems, you can resume the build with the command
[ERROR]   mvn <goals> -rf :hadoop-mapreduce-client-jobclient
Build step 'Execute shell' marked build as failure
[FINDBUGS] Skipping publisher since build result is FAILURE
Archiving artifacts
Recording test results
Email was triggered for: Failure - Any
Sending email for trigger: Failure - Any



###################################################################################
############################## FAILED TESTS (if any) ##############################
3 tests failed.
FAILED:  org.apache.hadoop.mapreduce.v2.TestMRJobs.testConfVerificationWithClassloader

Error Message:
test timed out after 300000 milliseconds

Stack Trace:
java.lang.Exception: test timed out after 300000 milliseconds
	at java.lang.Thread.sleep(Native Method)
	at org.apache.hadoop.mapreduce.Job.monitorAndPrintJob(Job.java:1404)
	at org.apache.hadoop.mapreduce.Job.waitForCompletion(Job.java:1362)
	at org.apache.hadoop.mapreduce.v2.TestMRJobs.testConfVerification(TestMRJobs.java:414)
	at org.apache.hadoop.mapreduce.v2.TestMRJobs.testConfVerificationWithClassloader(TestMRJobs.java:310)


FAILED:  org.apache.hadoop.mapreduce.v2.TestMRJobs.org.apache.hadoop.mapreduce.v2.TestMRJobs

Error Message:
org/apache/hadoop/service/ServiceOperations

Stack Trace:
java.lang.NoClassDefFoundError: org/apache/hadoop/service/ServiceOperations
	at java.net.URLClassLoader$1.run(URLClassLoader.java:366)
	at java.net.URLClassLoader$1.run(URLClassLoader.java:355)
	at java.security.AccessController.doPrivileged(Native Method)
	at java.net.URLClassLoader.findClass(URLClassLoader.java:354)
	at java.lang.ClassLoader.loadClass(ClassLoader.java:425)
	at sun.misc.Launcher$AppClassLoader.loadClass(Launcher.java:308)
	at java.lang.ClassLoader.loadClass(ClassLoader.java:358)
	at org.apache.hadoop.service.CompositeService.stop(CompositeService.java:157)
	at org.apache.hadoop.service.CompositeService.serviceStop(CompositeService.java:131)
	at org.apache.hadoop.service.AbstractService.stop(AbstractService.java:221)
	at org.apache.hadoop.mapreduce.v2.TestMRJobs.tearDown(TestMRJobs.java:177)


FAILED:  org.apache.hadoop.mapred.TestNetworkedJob.testNetworkedJob

Error Message:
expected:<[[Wed Feb 03 00:35:23 +0000 2016] Scheduler has assigned a container for AM,
waiting for AM container to be launched]> but was:<[]>

Stack Trace:
org.junit.ComparisonFailure: expected:<[[Wed Feb 03 00:35:23 +0000 2016] Scheduler has
assigned a container for AM, waiting for AM container to be launched]> but was:<[]>
	at org.junit.Assert.assertEquals(Assert.java:115)
	at org.junit.Assert.assertEquals(Assert.java:144)
	at org.apache.hadoop.mapred.TestNetworkedJob.testNetworkedJob(TestNetworkedJob.java:174)



Mime
  • Unnamed multipart/mixed (inline, None, 0 bytes)
View raw message