hadoop-mapreduce-dev mailing list archives

Site index · List index
Message view « Date » · « Thread »
Top « Date » · « Thread »
From Apache Jenkins Server <jenk...@builds.apache.org>
Subject Hadoop-Mapreduce-trunk - Build # 2916 - Still Failing
Date Wed, 03 Feb 2016 20:00:06 GMT
See https://builds.apache.org/job/Hadoop-Mapreduce-trunk/2916/

###################################################################################
########################## LAST 60 LINES OF THE CONSOLE ###########################
[...truncated 31733 lines...]
Tests run: 1, Failures: 0, Errors: 0, Skipped: 0, Time elapsed: 7.25 sec - in org.apache.hadoop.mapreduce.TestNewCombinerGrouping
Running org.apache.hadoop.mapreduce.TestMRJobClient
Tests run: 3, Failures: 0, Errors: 0, Skipped: 0, Time elapsed: 186.156 sec - in org.apache.hadoop.mapreduce.TestMRJobClient
Running org.apache.hadoop.mapreduce.TestMapCollection
Tests run: 11, Failures: 0, Errors: 0, Skipped: 0, Time elapsed: 14.333 sec - in org.apache.hadoop.mapreduce.TestMapCollection
Running org.apache.hadoop.conf.TestNoDefaultsJobConf
Tests run: 1, Failures: 0, Errors: 0, Skipped: 0, Time elapsed: 23.353 sec - in org.apache.hadoop.conf.TestNoDefaultsJobConf
Running org.apache.hadoop.util.TestMRCJCReflectionUtils
Tests run: 1, Failures: 0, Errors: 0, Skipped: 0, Time elapsed: 0.658 sec - in org.apache.hadoop.util.TestMRCJCReflectionUtils
Running org.apache.hadoop.util.TestMRCJCRunJar
Tests run: 1, Failures: 0, Errors: 0, Skipped: 0, Time elapsed: 0.251 sec - in org.apache.hadoop.util.TestMRCJCRunJar

Results :

Failed tests: 
  TestNetworkedJob.testNetworkedJob:174 expected:<[[Wed Feb 03 18:24:01 +0000 2016] Application
is Activated, waiting for resources to be assigned for AM.  Details : AM Partition = <DEFAULT_PARTITION>
; Partition Resource = <memory:8192, vCores:16> ; Queue's Absolute capacity = 100.0
% ; Queue's Absolute used capacity = 0.0 % ; Queue's Absolute max capacity = 100.0 % ; ]>
but was:<[]>

Tests run: 527, Failures: 1, Errors: 0, Skipped: 11

[INFO] ------------------------------------------------------------------------
[INFO] Reactor Summary:
[INFO] 
[INFO] Apache Hadoop MapReduce Client .................... SUCCESS [  3.042 s]
[INFO] Apache Hadoop MapReduce Core ...................... SUCCESS [01:48 min]
[INFO] Apache Hadoop MapReduce Common .................... SUCCESS [ 27.749 s]
[INFO] Apache Hadoop MapReduce Shuffle ................... SUCCESS [  5.983 s]
[INFO] Apache Hadoop MapReduce App ....................... SUCCESS [09:22 min]
[INFO] Apache Hadoop MapReduce HistoryServer ............. SUCCESS [05:42 min]
[INFO] Apache Hadoop MapReduce JobClient ................. FAILURE [  01:43 h]
[INFO] Apache Hadoop MapReduce HistoryServer Plugins ..... SKIPPED
[INFO] Apache Hadoop MapReduce NativeTask ................ SKIPPED
[INFO] Apache Hadoop MapReduce Examples .................. SKIPPED
[INFO] Apache Hadoop MapReduce ........................... SKIPPED
[INFO] ------------------------------------------------------------------------
[INFO] BUILD FAILURE
[INFO] ------------------------------------------------------------------------
[INFO] Total time: 02:01 h
[INFO] Finished at: 2016-02-03T19:59:59+00:00
[INFO] Final Memory: 33M/600M
[INFO] ------------------------------------------------------------------------
[ERROR] Failed to execute goal org.apache.maven.plugins:maven-surefire-plugin:2.17:test (default-test)
on project hadoop-mapreduce-client-jobclient: There are test failures.
[ERROR] 
[ERROR] Please refer to /home/jenkins/jenkins-slave/workspace/Hadoop-Mapreduce-trunk/hadoop-mapreduce-project/hadoop-mapreduce-client/hadoop-mapreduce-client-jobclient/target/surefire-reports
for the individual test results.
[ERROR] -> [Help 1]
[ERROR] 
[ERROR] To see the full stack trace of the errors, re-run Maven with the -e switch.
[ERROR] Re-run Maven using the -X switch to enable full debug logging.
[ERROR] 
[ERROR] For more information about the errors and possible solutions, please read the following
articles:
[ERROR] [Help 1] http://cwiki.apache.org/confluence/display/MAVEN/MojoFailureException
[ERROR] 
[ERROR] After correcting the problems, you can resume the build with the command
[ERROR]   mvn <goals> -rf :hadoop-mapreduce-client-jobclient
Build step 'Execute shell' marked build as failure
[FINDBUGS] Skipping publisher since build result is FAILURE
Archiving artifacts
Recording test results
Email was triggered for: Failure - Any
Sending email for trigger: Failure - Any



###################################################################################
############################## FAILED TESTS (if any) ##############################
1 tests failed.
FAILED:  org.apache.hadoop.mapred.TestNetworkedJob.testNetworkedJob

Error Message:
expected:<[[Wed Feb 03 18:24:01 +0000 2016] Application is Activated, waiting for resources
to be assigned for AM.  Details : AM Partition = <DEFAULT_PARTITION> ; Partition Resource
= <memory:8192, vCores:16> ; Queue's Absolute capacity = 100.0 % ; Queue's Absolute
used capacity = 0.0 % ; Queue's Absolute max capacity = 100.0 % ; ]> but was:<[]>

Stack Trace:
org.junit.ComparisonFailure: expected:<[[Wed Feb 03 18:24:01 +0000 2016] Application is
Activated, waiting for resources to be assigned for AM.  Details : AM Partition = <DEFAULT_PARTITION>
; Partition Resource = <memory:8192, vCores:16> ; Queue's Absolute capacity = 100.0
% ; Queue's Absolute used capacity = 0.0 % ; Queue's Absolute max capacity = 100.0 % ; ]>
but was:<[]>
	at org.junit.Assert.assertEquals(Assert.java:115)
	at org.junit.Assert.assertEquals(Assert.java:144)
	at org.apache.hadoop.mapred.TestNetworkedJob.testNetworkedJob(TestNetworkedJob.java:174)



Mime
  • Unnamed multipart/mixed (inline, None, 0 bytes)
View raw message