hadoop-mapreduce-dev mailing list archives

Site index · List index
Message view « Date » · « Thread »
Top « Date » · « Thread »
From Apache Jenkins Server <jenk...@builds.apache.org>
Subject Hadoop-Mapreduce-trunk - Build # 2902 - Still Failing
Date Mon, 01 Feb 2016 13:13:54 GMT
See https://builds.apache.org/job/Hadoop-Mapreduce-trunk/2902/

###################################################################################
########################## LAST 60 LINES OF THE CONSOLE ###########################
[...truncated 34657 lines...]
Tests run: 1, Failures: 0, Errors: 0, Skipped: 0, Time elapsed: 1.388 sec - in org.apache.hadoop.util.TestMRCJCReflectionUtils
Running org.apache.hadoop.util.TestMRCJCRunJar
Tests run: 1, Failures: 0, Errors: 0, Skipped: 0, Time elapsed: 0.427 sec - in org.apache.hadoop.util.TestMRCJCRunJar
Running org.apache.hadoop.io.TestSequenceFileMergeProgress
Tests run: 3, Failures: 0, Errors: 0, Skipped: 0, Time elapsed: 4.047 sec - in org.apache.hadoop.io.TestSequenceFileMergeProgress

Results :

Failed tests: 
  TestNetworkedJob.testNetworkedJob:174 expected:<[[Mon Feb 01 11:50:55 +0000 2016] Application
is Activated, waiting for resources to be assigned for AM.  Details : AM Partition = <DEFAULT_PARTITION>
; Partition Resource = <memory:8192, vCores:16> ; Queue's Absolute capacity = 100.0
% ; Queue's Absolute used capacity = 0.0 % ; Queue's Absolute max capacity = 100.0 % ; ]>
but was:<[]>
  TestRMNMInfo.testRMNMInfo:111 Unexpected number of live nodes: expected:<4> but was:<3>

Tests in error: 
  TestMRTimelineEventHandling.testMRTimelineEventHandling:103 » IO Job didn't fi...
  TestMRTimelineEventHandling.testMapreduceJobTimelineServiceEnabled:160 » IO Jo...
  TestMRJobsWithProfiler.testDifferentProfilers:117->testProfilerInternal:150 » 

Tests run: 527, Failures: 2, Errors: 3, Skipped: 11

[INFO] ------------------------------------------------------------------------
[INFO] Reactor Summary:
[INFO] 
[INFO] Apache Hadoop MapReduce Client .................... SUCCESS [  6.394 s]
[INFO] Apache Hadoop MapReduce Core ...................... SUCCESS [03:24 min]
[INFO] Apache Hadoop MapReduce Common .................... SUCCESS [ 44.938 s]
[INFO] Apache Hadoop MapReduce Shuffle ................... SUCCESS [  9.668 s]
[INFO] Apache Hadoop MapReduce App ....................... SUCCESS [13:17 min]
[INFO] Apache Hadoop MapReduce HistoryServer ............. SUCCESS [07:31 min]
[INFO] Apache Hadoop MapReduce JobClient ................. FAILURE [  02:26 h]
[INFO] Apache Hadoop MapReduce HistoryServer Plugins ..... SKIPPED
[INFO] Apache Hadoop MapReduce NativeTask ................ SKIPPED
[INFO] Apache Hadoop MapReduce Examples .................. SKIPPED
[INFO] Apache Hadoop MapReduce ........................... SKIPPED
[INFO] ------------------------------------------------------------------------
[INFO] BUILD FAILURE
[INFO] ------------------------------------------------------------------------
[INFO] Total time: 02:51 h
[INFO] Finished at: 2016-02-01T13:13:39+00:00
[INFO] Final Memory: 40M/1094M
[INFO] ------------------------------------------------------------------------
[ERROR] Failed to execute goal org.apache.maven.plugins:maven-surefire-plugin:2.17:test (default-test)
on project hadoop-mapreduce-client-jobclient: There are test failures.
[ERROR] 
[ERROR] Please refer to /home/jenkins/jenkins-slave/workspace/Hadoop-Mapreduce-trunk/hadoop-mapreduce-project/hadoop-mapreduce-client/hadoop-mapreduce-client-jobclient/target/surefire-reports
for the individual test results.
[ERROR] -> [Help 1]
[ERROR] 
[ERROR] To see the full stack trace of the errors, re-run Maven with the -e switch.
[ERROR] Re-run Maven using the -X switch to enable full debug logging.
[ERROR] 
[ERROR] For more information about the errors and possible solutions, please read the following
articles:
[ERROR] [Help 1] http://cwiki.apache.org/confluence/display/MAVEN/MojoFailureException
[ERROR] 
[ERROR] After correcting the problems, you can resume the build with the command
[ERROR]   mvn <goals> -rf :hadoop-mapreduce-client-jobclient
Build step 'Execute shell' marked build as failure
[FINDBUGS] Skipping publisher since build result is FAILURE
Archiving artifacts
Recording test results
Email was triggered for: Failure - Any
Sending email for trigger: Failure - Any



###################################################################################
############################## FAILED TESTS (if any) ##############################
5 tests failed.
FAILED:  org.apache.hadoop.mapred.TestMRTimelineEventHandling.testMRTimelineEventHandling

Error Message:
Job didn't finish in 30 seconds

Stack Trace:
java.io.IOException: Job didn't finish in 30 seconds
	at org.apache.hadoop.mapred.UtilsForTests.runJobSucceed(UtilsForTests.java:622)
	at org.apache.hadoop.mapred.TestMRTimelineEventHandling.testMRTimelineEventHandling(TestMRTimelineEventHandling.java:103)


FAILED:  org.apache.hadoop.mapred.TestMRTimelineEventHandling.testMapreduceJobTimelineServiceEnabled

Error Message:
Job didn't finish in 30 seconds

Stack Trace:
java.io.IOException: Job didn't finish in 30 seconds
	at org.apache.hadoop.mapred.UtilsForTests.runJobSucceed(UtilsForTests.java:622)
	at org.apache.hadoop.mapred.TestMRTimelineEventHandling.testMapreduceJobTimelineServiceEnabled(TestMRTimelineEventHandling.java:160)


FAILED:  org.apache.hadoop.mapred.TestNetworkedJob.testNetworkedJob

Error Message:
expected:<[[Mon Feb 01 11:50:55 +0000 2016] Application is Activated, waiting for resources
to be assigned for AM.  Details : AM Partition = <DEFAULT_PARTITION> ; Partition Resource
= <memory:8192, vCores:16> ; Queue's Absolute capacity = 100.0 % ; Queue's Absolute
used capacity = 0.0 % ; Queue's Absolute max capacity = 100.0 % ; ]> but was:<[]>

Stack Trace:
org.junit.ComparisonFailure: expected:<[[Mon Feb 01 11:50:55 +0000 2016] Application is
Activated, waiting for resources to be assigned for AM.  Details : AM Partition = <DEFAULT_PARTITION>
; Partition Resource = <memory:8192, vCores:16> ; Queue's Absolute capacity = 100.0
% ; Queue's Absolute used capacity = 0.0 % ; Queue's Absolute max capacity = 100.0 % ; ]>
but was:<[]>
	at org.junit.Assert.assertEquals(Assert.java:115)
	at org.junit.Assert.assertEquals(Assert.java:144)
	at org.apache.hadoop.mapred.TestNetworkedJob.testNetworkedJob(TestNetworkedJob.java:174)


FAILED:  org.apache.hadoop.mapreduce.v2.TestMRJobsWithProfiler.testDifferentProfilers

Error Message:
test timed out after 150000 milliseconds

Stack Trace:
java.lang.Exception: test timed out after 150000 milliseconds
	at java.lang.Thread.sleep(Native Method)
	at org.apache.hadoop.mapreduce.Job.monitorAndPrintJob(Job.java:1404)
	at org.apache.hadoop.mapreduce.Job.waitForCompletion(Job.java:1362)
	at org.apache.hadoop.mapreduce.v2.TestMRJobsWithProfiler.testProfilerInternal(TestMRJobsWithProfiler.java:150)
	at org.apache.hadoop.mapreduce.v2.TestMRJobsWithProfiler.testDifferentProfilers(TestMRJobsWithProfiler.java:117)


FAILED:  org.apache.hadoop.mapreduce.v2.TestRMNMInfo.testRMNMInfo

Error Message:
Unexpected number of live nodes: expected:<4> but was:<3>

Stack Trace:
java.lang.AssertionError: Unexpected number of live nodes: expected:<4> but was:<3>
	at org.junit.Assert.fail(Assert.java:88)
	at org.junit.Assert.failNotEquals(Assert.java:743)
	at org.junit.Assert.assertEquals(Assert.java:118)
	at org.junit.Assert.assertEquals(Assert.java:555)
	at org.apache.hadoop.mapreduce.v2.TestRMNMInfo.testRMNMInfo(TestRMNMInfo.java:111)



Mime
  • Unnamed multipart/mixed (inline, None, 0 bytes)
View raw message