hadoop-mapreduce-dev mailing list archives

Site index · List index
Message view « Date » · « Thread »
Top « Date » · « Thread »
From Apache Jenkins Server <jenk...@builds.apache.org>
Subject Hadoop-Mapreduce-trunk - Build # 2918 - Still Failing
Date Thu, 04 Feb 2016 00:59:51 GMT
See https://builds.apache.org/job/Hadoop-Mapreduce-trunk/2918/

###################################################################################
########################## LAST 60 LINES OF THE CONSOLE ###########################
[...truncated 31211 lines...]
Tests run: 3, Failures: 0, Errors: 0, Skipped: 0, Time elapsed: 16.929 sec - in org.apache.hadoop.mapreduce.v2.app.TestFetchFailure
Running org.apache.hadoop.mapreduce.v2.app.TestFail
Tests run: 5, Failures: 0, Errors: 0, Skipped: 0, Time elapsed: 17.537 sec - in org.apache.hadoop.mapreduce.v2.app.TestFail
Running org.apache.hadoop.mapreduce.v2.app.rm.TestRMCommunicator
Tests run: 2, Failures: 0, Errors: 0, Skipped: 0, Time elapsed: 0.809 sec - in org.apache.hadoop.mapreduce.v2.app.rm.TestRMCommunicator
Running org.apache.hadoop.mapreduce.v2.app.rm.TestResourceCalculatorUtils
Tests run: 1, Failures: 0, Errors: 0, Skipped: 0, Time elapsed: 0.51 sec - in org.apache.hadoop.mapreduce.v2.app.rm.TestResourceCalculatorUtils
Running org.apache.hadoop.mapreduce.v2.app.rm.TestRMContainerAllocator
Tests run: 26, Failures: 0, Errors: 0, Skipped: 0, Time elapsed: 103.887 sec - in org.apache.hadoop.mapreduce.v2.app.rm.TestRMContainerAllocator
Running org.apache.hadoop.mapreduce.jobhistory.TestEvents
Tests run: 5, Failures: 0, Errors: 0, Skipped: 0, Time elapsed: 0.745 sec - in org.apache.hadoop.mapreduce.jobhistory.TestEvents
Running org.apache.hadoop.mapreduce.jobhistory.TestJobSummary
Tests run: 1, Failures: 0, Errors: 0, Skipped: 0, Time elapsed: 0.446 sec - in org.apache.hadoop.mapreduce.jobhistory.TestJobSummary
Running org.apache.hadoop.mapreduce.jobhistory.TestJobHistoryEventHandler
Tests run: 13, Failures: 0, Errors: 0, Skipped: 0, Time elapsed: 23.358 sec - in org.apache.hadoop.mapreduce.jobhistory.TestJobHistoryEventHandler

Results :

Tests run: 337, Failures: 0, Errors: 0, Skipped: 0

[INFO] ------------------------------------------------------------------------
[INFO] Reactor Summary:
[INFO] 
[INFO] Apache Hadoop MapReduce Client .................... SUCCESS [  2.813 s]
[INFO] Apache Hadoop MapReduce Core ...................... SUCCESS [01:54 min]
[INFO] Apache Hadoop MapReduce Common .................... SUCCESS [ 27.037 s]
[INFO] Apache Hadoop MapReduce Shuffle ................... SUCCESS [  5.698 s]
[INFO] Apache Hadoop MapReduce App ....................... FAILURE [09:06 min]
[INFO] Apache Hadoop MapReduce HistoryServer ............. SKIPPED
[INFO] Apache Hadoop MapReduce JobClient ................. SKIPPED
[INFO] Apache Hadoop MapReduce HistoryServer Plugins ..... SKIPPED
[INFO] Apache Hadoop MapReduce NativeTask ................ SKIPPED
[INFO] Apache Hadoop MapReduce Examples .................. SKIPPED
[INFO] Apache Hadoop MapReduce ........................... SKIPPED
[INFO] ------------------------------------------------------------------------
[INFO] BUILD FAILURE
[INFO] ------------------------------------------------------------------------
[INFO] Total time: 11:37 min
[INFO] Finished at: 2016-02-04T00:59:47+00:00
[INFO] Final Memory: 33M/674M
[INFO] ------------------------------------------------------------------------
[ERROR] Failed to execute goal org.apache.maven.plugins:maven-surefire-plugin:2.17:test (default-test)
on project hadoop-mapreduce-client-app: ExecutionException: java.lang.RuntimeException: The
forked VM terminated without properly saying goodbye. VM crash or System.exit called?
[ERROR] Command was /bin/sh -c cd /home/jenkins/jenkins-slave/workspace/Hadoop-Mapreduce-trunk/hadoop-mapreduce-project/hadoop-mapreduce-client/hadoop-mapreduce-client-app
&& /home/jenkins/tools/java/jdk1.7.0_55/jre/bin/java -Xmx2048m -XX:MaxPermSize=768m
-XX:+HeapDumpOnOutOfMemoryError -jar /home/jenkins/jenkins-slave/workspace/Hadoop-Mapreduce-trunk/hadoop-mapreduce-project/hadoop-mapreduce-client/hadoop-mapreduce-client-app/target/surefire/surefirebooter56606188140194373.jar
/home/jenkins/jenkins-slave/workspace/Hadoop-Mapreduce-trunk/hadoop-mapreduce-project/hadoop-mapreduce-client/hadoop-mapreduce-client-app/target/surefire/surefire6621690261645961078tmp
/home/jenkins/jenkins-slave/workspace/Hadoop-Mapreduce-trunk/hadoop-mapreduce-project/hadoop-mapreduce-client/hadoop-mapreduce-client-app/target/surefire/surefire_992635901264465985659tmp
[ERROR] -> [Help 1]
[ERROR] 
[ERROR] To see the full stack trace of the errors, re-run Maven with the -e switch.
[ERROR] Re-run Maven using the -X switch to enable full debug logging.
[ERROR] 
[ERROR] For more information about the errors and possible solutions, please read the following
articles:
[ERROR] [Help 1] http://cwiki.apache.org/confluence/display/MAVEN/MojoFailureException
[ERROR] 
[ERROR] After correcting the problems, you can resume the build with the command
[ERROR]   mvn <goals> -rf :hadoop-mapreduce-client-app
Build step 'Execute shell' marked build as failure
[FINDBUGS] Skipping publisher since build result is FAILURE
Archiving artifacts
Recording test results
Email was triggered for: Failure - Any
Sending email for trigger: Failure - Any



###################################################################################
############################## FAILED TESTS (if any) ##############################
All tests passed
Mime
  • Unnamed multipart/mixed (inline, None, 0 bytes)
View raw message