hadoop-mapreduce-dev mailing list archives

Site index · List index
Message view « Date » · « Thread »
Top « Date » · « Thread »
From Apache Jenkins Server <jenk...@builds.apache.org>
Subject Hadoop-Mapreduce-trunk-Java8 - Build # 1252 - Still Failing
Date Fri, 08 Apr 2016 16:29:47 GMT
See https://builds.apache.org/job/Hadoop-Mapreduce-trunk-Java8/1252/

###################################################################################
########################## LAST 60 LINES OF THE CONSOLE ###########################
[...truncated 4168 lines...]
Running org.apache.hadoop.mapreduce.v2.app.TestMRApp
Tests run: 13, Failures: 0, Errors: 0, Skipped: 0, Time elapsed: 23.412 sec - in org.apache.hadoop.mapreduce.v2.app.TestMRApp
Java HotSpot(TM) 64-Bit Server VM warning: ignoring option MaxPermSize=768m; support was removed
in 8.0
Running org.apache.hadoop.mapred.TestTaskAttemptFinishingMonitor
Tests run: 1, Failures: 0, Errors: 0, Skipped: 0, Time elapsed: 1.265 sec - in org.apache.hadoop.mapred.TestTaskAttemptFinishingMonitor
Java HotSpot(TM) 64-Bit Server VM warning: ignoring option MaxPermSize=768m; support was removed
in 8.0
Running org.apache.hadoop.mapred.TestTaskAttemptListenerImpl
Tests run: 6, Failures: 0, Errors: 0, Skipped: 0, Time elapsed: 1.045 sec - in org.apache.hadoop.mapred.TestTaskAttemptListenerImpl
Java HotSpot(TM) 64-Bit Server VM warning: ignoring option MaxPermSize=768m; support was removed
in 8.0
Running org.apache.hadoop.mapred.TestLocalContainerLauncher
Tests run: 2, Failures: 0, Errors: 0, Skipped: 0, Time elapsed: 1.684 sec - in org.apache.hadoop.mapred.TestLocalContainerLauncher

Results :

Tests in error: 
  TestJobHistoryEventHandler.cleanUpClass:98 ยป NoClassDefFound org/apache/hadoop...

Tests run: 341, Failures: 0, Errors: 1, Skipped: 0

[INFO] ------------------------------------------------------------------------
[INFO] Reactor Summary:
[INFO] 
[INFO] Apache Hadoop MapReduce Client .................... SUCCESS [  2.299 s]
[INFO] Apache Hadoop MapReduce Core ...................... SUCCESS [01:45 min]
[INFO] Apache Hadoop MapReduce Common .................... SUCCESS [ 26.898 s]
[INFO] Apache Hadoop MapReduce Shuffle ................... SUCCESS [  4.767 s]
[INFO] Apache Hadoop MapReduce App ....................... FAILURE [11:04 min]
[INFO] Apache Hadoop MapReduce HistoryServer ............. SKIPPED
[INFO] Apache Hadoop MapReduce JobClient ................. SKIPPED
[INFO] Apache Hadoop MapReduce HistoryServer Plugins ..... SKIPPED
[INFO] Apache Hadoop MapReduce NativeTask ................ SKIPPED
[INFO] Apache Hadoop MapReduce Examples .................. SKIPPED
[INFO] Apache Hadoop MapReduce ........................... SKIPPED
[INFO] ------------------------------------------------------------------------
[INFO] BUILD FAILURE
[INFO] ------------------------------------------------------------------------
[INFO] Total time: 13:24 min
[INFO] Finished at: 2016-04-08T16:29:50+00:00
[INFO] Final Memory: 55M/293M
[INFO] ------------------------------------------------------------------------
[ERROR] Failed to execute goal org.apache.maven.plugins:maven-surefire-plugin:2.17:test (default-test)
on project hadoop-mapreduce-client-app: There are test failures.
[ERROR] 
[ERROR] Please refer to /home/jenkins/jenkins-slave/workspace/Hadoop-Mapreduce-trunk-Java8/hadoop-mapreduce-project/hadoop-mapreduce-client/hadoop-mapreduce-client-app/target/surefire-reports
for the individual test results.
[ERROR] -> [Help 1]
[ERROR] 
[ERROR] To see the full stack trace of the errors, re-run Maven with the -e switch.
[ERROR] Re-run Maven using the -X switch to enable full debug logging.
[ERROR] 
[ERROR] For more information about the errors and possible solutions, please read the following
articles:
[ERROR] [Help 1] http://cwiki.apache.org/confluence/display/MAVEN/MojoFailureException
[ERROR] 
[ERROR] After correcting the problems, you can resume the build with the command
[ERROR]   mvn <goals> -rf :hadoop-mapreduce-client-app
Build step 'Execute shell' marked build as failure
[FINDBUGS] Skipping publisher since build result is FAILURE
Archiving artifacts
Recording test results
Email was triggered for: Failure - Any
Sending email for trigger: Failure - Any



###################################################################################
############################## FAILED TESTS (if any) ##############################
1 tests failed.
FAILED:  org.apache.hadoop.mapreduce.jobhistory.TestJobHistoryEventHandler.org.apache.hadoop.mapreduce.jobhistory.TestJobHistoryEventHandler

Error Message:
org/apache/hadoop/util/IntrusiveCollection$IntrusiveIterator

Stack Trace:
java.lang.NoClassDefFoundError: org/apache/hadoop/util/IntrusiveCollection$IntrusiveIterator
	at org.apache.hadoop.util.IntrusiveCollection.iterator(IntrusiveCollection.java:213)
	at org.apache.hadoop.util.IntrusiveCollection.clear(IntrusiveCollection.java:368)
	at org.apache.hadoop.hdfs.server.blockmanagement.DatanodeManager.clearPendingCachingCommands(DatanodeManager.java:1658)
	at org.apache.hadoop.hdfs.server.namenode.FSNamesystem.stopActiveServices(FSNamesystem.java:1214)
	at org.apache.hadoop.hdfs.server.namenode.FSNamesystem.close(FSNamesystem.java:1559)
	at org.apache.hadoop.hdfs.server.namenode.NameNode.stopCommonServices(NameNode.java:790)
	at org.apache.hadoop.hdfs.server.namenode.NameNode.stop(NameNode.java:969)
	at org.apache.hadoop.hdfs.MiniDFSCluster.stopAndJoinNameNode(MiniDFSCluster.java:1965)
	at org.apache.hadoop.hdfs.MiniDFSCluster.shutdown(MiniDFSCluster.java:1911)
	at org.apache.hadoop.hdfs.MiniDFSCluster.shutdown(MiniDFSCluster.java:1882)
	at org.apache.hadoop.hdfs.MiniDFSCluster.shutdown(MiniDFSCluster.java:1875)
	at org.apache.hadoop.mapreduce.jobhistory.TestJobHistoryEventHandler.cleanUpClass(TestJobHistoryEventHandler.java:98)



Mime
  • Unnamed multipart/mixed (inline, None, 0 bytes)
View raw message