hadoop-mapreduce-dev mailing list archives

Site index · List index
Message view « Date » · « Thread »
Top « Date » · « Thread »
From Apache Jenkins Server <jenk...@builds.apache.org>
Subject Hadoop-Mapreduce-trunk - Build # 3205 - Still Failing
Date Fri, 15 Apr 2016 22:29:57 GMT
See https://builds.apache.org/job/Hadoop-Mapreduce-trunk/3205/

###################################################################################
########################## LAST 60 LINES OF THE CONSOLE ###########################
[...truncated 31470 lines...]
Running org.apache.hadoop.mapreduce.v2.app.webapp.TestAMWebServices
Tests run: 13, Failures: 0, Errors: 0, Skipped: 0, Time elapsed: 9.401 sec - in org.apache.hadoop.mapreduce.v2.app.webapp.TestAMWebServices
Running org.apache.hadoop.mapreduce.v2.app.webapp.TestAMWebServicesAttempts
Tests run: 15, Failures: 0, Errors: 0, Skipped: 0, Time elapsed: 10.774 sec - in org.apache.hadoop.mapreduce.v2.app.webapp.TestAMWebServicesAttempts
Running org.apache.hadoop.mapreduce.v2.app.webapp.TestAMWebServicesJobs
Tests run: 21, Failures: 0, Errors: 0, Skipped: 0, Time elapsed: 12.672 sec - in org.apache.hadoop.mapreduce.v2.app.webapp.TestAMWebServicesJobs
Running org.apache.hadoop.mapreduce.v2.app.webapp.TestAMWebServicesAttempt
Tests run: 4, Failures: 0, Errors: 0, Skipped: 0, Time elapsed: 5.963 sec - in org.apache.hadoop.mapreduce.v2.app.webapp.TestAMWebServicesAttempt
Running org.apache.hadoop.mapreduce.TestMapreduceConfigFields
Tests run: 2, Failures: 0, Errors: 0, Skipped: 0, Time elapsed: 0.993 sec - in org.apache.hadoop.mapreduce.TestMapreduceConfigFields

Results :

Failed tests: 
  TestTaskAttempt.testMRAppHistoryForTAFailedInAssigned:190->testTaskAttemptAssignedKilledHistory:403
No Ta Started JH Event
  TestJobImpl.testUnusableNodeTransition:629->assertJobState:1012 expected:<SUCCEEDED>
but was:<ERROR>

Tests run: 344, Failures: 2, Errors: 0, Skipped: 0

[INFO] ------------------------------------------------------------------------
[INFO] Reactor Summary:
[INFO] 
[INFO] Apache Hadoop MapReduce Client .................... SUCCESS [  3.647 s]
[INFO] Apache Hadoop MapReduce Core ...................... SUCCESS [02:11 min]
[INFO] Apache Hadoop MapReduce Common .................... SUCCESS [ 32.704 s]
[INFO] Apache Hadoop MapReduce Shuffle ................... SUCCESS [  7.292 s]
[INFO] Apache Hadoop MapReduce App ....................... FAILURE [10:23 min]
[INFO] Apache Hadoop MapReduce HistoryServer ............. SKIPPED
[INFO] Apache Hadoop MapReduce JobClient ................. SKIPPED
[INFO] Apache Hadoop MapReduce HistoryServer Plugins ..... SKIPPED
[INFO] Apache Hadoop MapReduce NativeTask ................ SKIPPED
[INFO] Apache Hadoop MapReduce Examples .................. SKIPPED
[INFO] Apache Hadoop MapReduce ........................... SKIPPED
[INFO] ------------------------------------------------------------------------
[INFO] BUILD FAILURE
[INFO] ------------------------------------------------------------------------
[INFO] Total time: 13:20 min
[INFO] Finished at: 2016-04-15T22:29:55+00:00
[INFO] Final Memory: 36M/868M
[INFO] ------------------------------------------------------------------------
[ERROR] Failed to execute goal org.apache.maven.plugins:maven-surefire-plugin:2.17:test (default-test)
on project hadoop-mapreduce-client-app: There are test failures.
[ERROR] 
[ERROR] Please refer to /home/jenkins/jenkins-slave/workspace/Hadoop-Mapreduce-trunk/hadoop-mapreduce-project/hadoop-mapreduce-client/hadoop-mapreduce-client-app/target/surefire-reports
for the individual test results.
[ERROR] -> [Help 1]
[ERROR] 
[ERROR] To see the full stack trace of the errors, re-run Maven with the -e switch.
[ERROR] Re-run Maven using the -X switch to enable full debug logging.
[ERROR] 
[ERROR] For more information about the errors and possible solutions, please read the following
articles:
[ERROR] [Help 1] http://cwiki.apache.org/confluence/display/MAVEN/MojoFailureException
[ERROR] 
[ERROR] After correcting the problems, you can resume the build with the command
[ERROR]   mvn <goals> -rf :hadoop-mapreduce-client-app
Build step 'Execute shell' marked build as failure
[FINDBUGS] Skipping publisher since build result is FAILURE
Archiving artifacts
Recording test results
Email was triggered for: Failure - Any
Sending email for trigger: Failure - Any



###################################################################################
############################## FAILED TESTS (if any) ##############################
2 tests failed.
FAILED:  org.apache.hadoop.mapreduce.v2.app.job.impl.TestJobImpl.testUnusableNodeTransition

Error Message:
expected:<SUCCEEDED> but was:<ERROR>

Stack Trace:
java.lang.AssertionError: expected:<SUCCEEDED> but was:<ERROR>
	at org.junit.Assert.fail(Assert.java:88)
	at org.junit.Assert.failNotEquals(Assert.java:743)
	at org.junit.Assert.assertEquals(Assert.java:118)
	at org.junit.Assert.assertEquals(Assert.java:144)
	at org.apache.hadoop.mapreduce.v2.app.job.impl.TestJobImpl.assertJobState(TestJobImpl.java:1012)
	at org.apache.hadoop.mapreduce.v2.app.job.impl.TestJobImpl.testUnusableNodeTransition(TestJobImpl.java:629)


FAILED:  org.apache.hadoop.mapreduce.v2.app.job.impl.TestTaskAttempt.testMRAppHistoryForTAFailedInAssigned

Error Message:
No Ta Started JH Event

Stack Trace:
java.lang.AssertionError: No Ta Started JH Event
	at org.junit.Assert.fail(Assert.java:88)
	at org.junit.Assert.assertTrue(Assert.java:41)
	at org.apache.hadoop.mapreduce.v2.app.job.impl.TestTaskAttempt.testTaskAttemptAssignedKilledHistory(TestTaskAttempt.java:403)
	at org.apache.hadoop.mapreduce.v2.app.job.impl.TestTaskAttempt.testMRAppHistoryForTAFailedInAssigned(TestTaskAttempt.java:190)



Mime
  • Unnamed multipart/mixed (inline, None, 0 bytes)
View raw message