hadoop-mapreduce-dev mailing list archives

Site index · List index
Message view « Date » · « Thread »
Top « Date » · « Thread »
From Apache Jenkins Server <jenk...@builds.apache.org>
Subject Hadoop-Mapreduce-trunk - Build # 3249 - Still Failing
Date Tue, 26 Apr 2016 18:27:50 GMT
See https://builds.apache.org/job/Hadoop-Mapreduce-trunk/3249/

###################################################################################
########################## LAST 60 LINES OF THE CONSOLE ###########################
[...truncated 31594 lines...]
Tests run: 13, Failures: 0, Errors: 0, Skipped: 0, Time elapsed: 9.797 sec - in org.apache.hadoop.mapreduce.v2.app.webapp.TestAMWebServices
Running org.apache.hadoop.mapreduce.v2.app.TestTaskHeartbeatHandler
Tests run: 1, Failures: 0, Errors: 0, Skipped: 0, Time elapsed: 1.09 sec - in org.apache.hadoop.mapreduce.v2.app.TestTaskHeartbeatHandler
Running org.apache.hadoop.mapreduce.v2.app.TestFetchFailure
Tests run: 3, Failures: 0, Errors: 0, Skipped: 0, Time elapsed: 18.408 sec - in org.apache.hadoop.mapreduce.v2.app.TestFetchFailure
Running org.apache.hadoop.mapreduce.jobhistory.TestJobSummary
Tests run: 1, Failures: 0, Errors: 0, Skipped: 0, Time elapsed: 0.525 sec - in org.apache.hadoop.mapreduce.jobhistory.TestJobSummary
Running org.apache.hadoop.mapreduce.jobhistory.TestJobHistoryEventHandler
Tests run: 13, Failures: 0, Errors: 0, Skipped: 0, Time elapsed: 26.168 sec - in org.apache.hadoop.mapreduce.jobhistory.TestJobHistoryEventHandler
Running org.apache.hadoop.mapreduce.jobhistory.TestEvents
Tests run: 5, Failures: 0, Errors: 0, Skipped: 0, Time elapsed: 0.855 sec - in org.apache.hadoop.mapreduce.jobhistory.TestEvents

Results :

Failed tests: 
  TestJobImpl.testUnusableNodeTransition:625->assertJobState:1012 expected:<COMMITTING>
but was:<ERROR>

Tests run: 344, Failures: 1, Errors: 0, Skipped: 0

[INFO] ------------------------------------------------------------------------
[INFO] Reactor Summary:
[INFO] 
[INFO] Apache Hadoop MapReduce Client .................... SUCCESS [  3.864 s]
[INFO] Apache Hadoop MapReduce Core ...................... SUCCESS [03:36 min]
[INFO] Apache Hadoop MapReduce Common .................... SUCCESS [01:00 min]
[INFO] Apache Hadoop MapReduce Shuffle ................... SUCCESS [ 12.541 s]
[INFO] Apache Hadoop MapReduce App ....................... FAILURE [13:58 min]
[INFO] Apache Hadoop MapReduce HistoryServer ............. SKIPPED
[INFO] Apache Hadoop MapReduce JobClient ................. SKIPPED
[INFO] Apache Hadoop MapReduce HistoryServer Plugins ..... SKIPPED
[INFO] Apache Hadoop MapReduce NativeTask ................ SKIPPED
[INFO] Apache Hadoop MapReduce Examples .................. SKIPPED
[INFO] Apache Hadoop MapReduce ........................... SKIPPED
[INFO] ------------------------------------------------------------------------
[INFO] BUILD FAILURE
[INFO] ------------------------------------------------------------------------
[INFO] Total time: 18:53 min
[INFO] Finished at: 2016-04-26T18:27:25+00:00
[INFO] Final Memory: 43M/1247M
[INFO] ------------------------------------------------------------------------
[ERROR] Failed to execute goal org.apache.maven.plugins:maven-surefire-plugin:2.17:test (default-test)
on project hadoop-mapreduce-client-app: There are test failures.
[ERROR] 
[ERROR] Please refer to /home/jenkins/jenkins-slave/workspace/Hadoop-Mapreduce-trunk/hadoop-mapreduce-project/hadoop-mapreduce-client/hadoop-mapreduce-client-app/target/surefire-reports
for the individual test results.
[ERROR] -> [Help 1]
[ERROR] 
[ERROR] To see the full stack trace of the errors, re-run Maven with the -e switch.
[ERROR] Re-run Maven using the -X switch to enable full debug logging.
[ERROR] 
[ERROR] For more information about the errors and possible solutions, please read the following
articles:
[ERROR] [Help 1] http://cwiki.apache.org/confluence/display/MAVEN/MojoFailureException
[ERROR] 
[ERROR] After correcting the problems, you can resume the build with the command
[ERROR]   mvn <goals> -rf :hadoop-mapreduce-client-app
Build step 'Execute shell' marked build as failure
[FINDBUGS] Skipping publisher since build result is FAILURE
Archiving artifacts
Recording test results
Email was triggered for: Failure - Any
Sending email for trigger: Failure - Any



###################################################################################
############################## FAILED TESTS (if any) ##############################
1 tests failed.
FAILED:  org.apache.hadoop.mapreduce.v2.app.job.impl.TestJobImpl.testUnusableNodeTransition

Error Message:
expected:<COMMITTING> but was:<ERROR>

Stack Trace:
java.lang.AssertionError: expected:<COMMITTING> but was:<ERROR>
	at org.junit.Assert.fail(Assert.java:88)
	at org.junit.Assert.failNotEquals(Assert.java:743)
	at org.junit.Assert.assertEquals(Assert.java:118)
	at org.junit.Assert.assertEquals(Assert.java:144)
	at org.apache.hadoop.mapreduce.v2.app.job.impl.TestJobImpl.assertJobState(TestJobImpl.java:1012)
	at org.apache.hadoop.mapreduce.v2.app.job.impl.TestJobImpl.testUnusableNodeTransition(TestJobImpl.java:625)



Mime
  • Unnamed multipart/mixed (inline, None, 0 bytes)
View raw message